{"text_format":"1","workbook":"xlsx","n_sheets":9,"sheets":["Welcome","Data Input","P1 Hidden Data Tables","Pupil Summary","Cohort Summary","Strand Summary","Questions by Strand","Questions by Correct","Questions by Sub Type"],"not_rendered":{"charts":6,"images":1,"macros":1,"external_links":0,"defined_names":10,"comments":0,"pivot_tables":0},"unopened":[],"bounds":{"document_bytes":16777216,"sheet_cells":100000,"rows_first":2000,"rows_last":500,"rows_between":2000,"halvings":0,"cell_chars":16384,"cell_head_chars":4096},"cells_cut":0,"cells_raw":0,"read":"whole","date_system":"1900"}

{"sheet":"Welcome","index":0,"n_rows":23,"n_cols":11,"rows_kept":23,"cut":false,"hidden":false,"merged":[[1,3,1,12]]}
[]
[null,null,null,"2016 KS1 Mathematics Arithmetic Analysis"]
[]
[]
[]
[]
[]
[]
[]
[]
{"$rows_left_out":14}
{"sheet":"Data Input","index":1,"n_rows":10,"n_cols":27,"rows_kept":10,"cut":false,"hidden":false,"merged":[[0,1,4,1]]}
["Question","Mental",1,2,3,4,5,6,7,8,9,10,11,12,13,14,15,16,17,18,19,20,21,22,23,24,25]
["Group Correct",null,{"$f":"COUNTIF(C10:C278,1)","v":1},{"$f":"COUNTIF(D10:D278,1)","v":1},1,1,1,1,1,0,1,1,1,0,1,1,1,1,1,1,1,1,{"$f":"COUNTIF(W10:W278,1)","v":1},{"$f":"COUNTIF(X10:X278,1)","v":1},{"$f":"COUNTIF(Y10:Y278,1)","v":1},{"$f":"COUNTIF(Z10:Z278,1)","v":0},{"$f":"COUNTIF(AA10:AA278,1)","v":1}]
["Group Incorrect",null,{"$f":"COUNTIF(C10:C278,0)","v":0},{"$f":"COUNTIF(D10:D278,0)","v":0},0,0,0,0,0,1,0,0,0,0,0,0,0,0,0,0,0,0,{"$f":"COUNTIF(W10:W278,0)","v":0},{"$f":"COUNTIF(X10:X278,0)","v":0},{"$f":"COUNTIF(Y10:Y278,0)","v":0},{"$f":"COUNTIF(Z10:Z278,0)","v":1},{"$f":"COUNTIF(AA10:AA278,0)","v":0}]
["Group Unanswered",null,{"$f":"COUNTA($A$10:$A$278)-(SUM(C2:C3))","v":0},0,0,0,0,0,0,0,0,{"$f":"COUNTA($A$10:$A$278)-(SUM(L2:L3))","v":0},{"$f":"COUNTA($A$10:$A$278)-(SUM(M2:M3))","v":0},1,0,0,0,0,0,0,0,0,{"$f":"COUNTA($A$10:$A$278)-(SUM(W2:W3))","v":0},{"$f":"COUNTA($A$10:$A$278)-(SUM(X2:X3))","v":0},{"$f":"COUNTA($A$10:$A$278)-(SUM(Y2:Y3))","v":0},{"$f":"COUNTA($A$10:$A$278)-(SUM(Z2:Z3))","v":0},{"$f":"COUNTA($A$10:$A$278)-(SUM(AA2:AA3))","v":0}]
["Incorrect or unanswered",null,{"$f":"SUM(C3,C4)","v":0},{"$f":"SUM(D3,D4)","v":0},0,0,0,0,0,1,0,0,0,1,0,0,0,0,0,0,0,0,{"$f":"SUM(W3,W4)","v":0},{"$f":"SUM(X3,X4)","v":0},{"$f":"SUM(Y3,Y4)","v":0},{"$f":"SUM(Z3,Z4)","v":1},{"$f":"SUM(AA3,AA4)","v":0}]
["1 = correct, 0 = incorrect, blank = unanswered\n\n+: Addition\n-: Subtraction\nx: Multipliction\n÷: Division\nF:  Fraction\nI: Inverse required\nM: Multi Step",null,"8 + 6","12 - 7","10 - __ = 2","52 + 7","4 + 5 + 6","9 x 10 =","3 x 2 =","50 + __ = 80","56 - __ = 51","10 + 40 + 20 =","63 - 10 - 10 =","8 x 5 =","21 + 40 =","8 ÷ 2 = ","28 + __ = 35","69 + 11 =","6 x 3 =","1/2 of 16 =","55 + 17 =","40 ÷ 10 =","55 ÷ 5 = ","1/4 of 12 = ","71 - 14 = ","1/3 of 30 =","3/4 of 20 ="]
["Sub category","Sub","","","I","","M","","","I","I","M","M","","","","I","","","","","","","","I","",""]
["Name:         Prime Strand:","Prime","+","-","-","+","+","x","x","+","-","+","-","x","+","÷","+","+","x","F","+","÷","÷","F","-","F","F"]
[]
["Sample - please delete!",null,1,1,1,1,1,1,1,0,1,1,1,null,1,1,1,1,1,1,1,1,1,1,1,0,1]
{"$rows_left_out":1}
{"sheet":"P1 Hidden Data Tables","index":2,"n_rows":129,"n_cols":22,"rows_kept":129,"cut":false,"hidden":true,"merged":[]}
[null,"In order of question"]
[null,"Strand","Question Number","Sub Category","Short Q","Correct","Incorrect or Unanswered","Incorrect","Unanswered"]
["C",{"$f":"'Data Input'!$C$8","v":"+"},{"$f":"'Data Input'!$C$1","v":1},{"$f":"'Data Input'!$C$7","v":""},{"$f":"'Data Input'!$C$6","v":"8 + 6"},{"$f":"'Data Input'!$C$2","v":1},{"$f":"'Data Input'!$C$5","v":0},{"$f":"'Data Input'!$C$3","v":0},{"$f":"'Data Input'!$C$4","v":0},null,null,null,"Codes"]
["D",{"$f":"'Data Input'!$D$8","v":"-"},{"$f":"'Data Input'!$D$1","v":2},{"$f":"'Data Input'!$D$7","v":""},{"$f":"'Data Input'!$D$6","v":"12 - 7"},{"$f":"'Data Input'!$D$2","v":1},{"$f":"'Data Input'!$D$5","v":0},{"$f":"'Data Input'!$D$3","v":0},{"$f":"'Data Input'!$D$4","v":0}]
["E",{"$f":"'Data Input'!$E$8","v":"-"},{"$f":"'Data Input'!$E$1","v":3},{"$f":"'Data Input'!$E$7","v":"I"},{"$f":"'Data Input'!$E$6","v":"10 - __ = 2"},{"$f":"'Data Input'!$E$2","v":1},{"$f":"'Data Input'!$E$5","v":0},{"$f":"'Data Input'!$E$3","v":0},{"$f":"'Data Input'!$E$4","v":0}]
["F",{"$f":"'Data Input'!$F$8","v":"+"},{"$f":"'Data Input'!$F$1","v":4},{"$f":"'Data Input'!$F$7","v":""},{"$f":"'Data Input'!$F$6","v":"52 + 7"},{"$f":"'Data Input'!$F$2","v":1},{"$f":"'Data Input'!$F$5","v":0},{"$f":"'Data Input'!$F$3","v":0},{"$f":"'Data Input'!$F$4","v":0}]
["G",{"$f":"'Data Input'!$G$8","v":"+"},{"$f":"'Data Input'!$G$1","v":5},{"$f":"'Data Input'!$G$7","v":"M"},{"$f":"'Data Input'!$G$6","v":"4 + 5 + 6"},{"$f":"'Data Input'!$G$2","v":1},{"$f":"'Data Input'!$G$5","v":0},{"$f":"'Data Input'!$G$3","v":0},{"$f":"'Data Input'!$G$4","v":0}]
["H",{"$f":"'Data Input'!$H$8","v":"x"},{"$f":"'Data Input'!$H$1","v":6},{"$f":"'Data Input'!$H$7","v":""},{"$f":"'Data Input'!$H$6","v":"9 x 10 ="},{"$f":"'Data Input'!$H$2","v":1},{"$f":"'Data Input'!$H$5","v":0},{"$f":"'Data Input'!$H$3","v":0},{"$f":"'Data Input'!$H$4","v":0}]
["I",{"$f":"'Data Input'!$I$8","v":"x"},{"$f":"'Data Input'!$I$1","v":7},{"$f":"'Data Input'!$I$7","v":""},{"$f":"'Data Input'!$I$6","v":"3 x 2 ="},{"$f":"'Data Input'!$I$2","v":1},{"$f":"'Data Input'!$I$5","v":0},{"$f":"'Data Input'!$I$3","v":0},{"$f":"'Data Input'!$I$4","v":0}]
["J",{"$f":"'Data Input'!$J$8","v":"+"},{"$f":"'Data Input'!$J$1","v":8},{"$f":"'Data Input'!$J$7","v":"I"},{"$f":"'Data Input'!$J$6","v":"50 + __ = 80"},{"$f":"'Data Input'!$J$2","v":0},{"$f":"'Data Input'!$J$5","v":1},{"$f":"'Data Input'!$J$3","v":1},{"$f":"'Data Input'!$J$4","v":0}]
{"$rows_left_out":120}
{"sheet":"Pupil Summary","index":3,"n_rows":273,"n_cols":16,"rows_kept":273,"cut":false,"hidden":false,"merged":[[1,14,1,15],[1,1,1,5],[1,6,1,7],[1,8,1,9],[1,10,1,11],[1,12,1,13]]}
[null,null,"Green: <35%, Amber: <50%, Red: >50%",null,"Green %>",0.64,"Amber %>",0.37,"Red %<",{"$f":"H1","v":0.37},null,null,null,null,"Pupil Summary"]
[{"$f":"\"Total Pupils: \" & COUNTA('Data Input'!A10:A278)","v":"Total Pupils: 1"},"Overall",null,null,null,null,"+",null,"-",null,"x",null,"÷",null,"F"]
["Name:","Unanswered","Incorrect","Incorrecr or Unanswered",{"$f":"\"Total Score \"&COUNTA('Data Input'!C8:AA8)","v":"Total Score 25"},"Percent",{"$f":"\"Score /\" & COUNTIF('Data Input'!$C$8:$AA$8,\"+\")","v":"Score /9"},"Percent",{"$f":"\"Score /\" & COUNTIF('Data Input'!$C$8:$AA$8,\"-\")","v":"Score /5"},"Percent",{"$f":"\"Score /\" & COUNTIF('Data Input'!$C$8:$AA$8,\"x\")","v":"Score /4"},"Percent ",{"$f":"\"Score /\" & COUNTIF('Data Input'!$C$8:$AA$8,\"÷\")","v":"Score /3"},"Percent ",{"$f":"\"Score /\" & COUNTIF('Data Input'!$C$8:$AA$8,\"F\")","v":"Score /4"},"Percent "]
[]
[{"$f":"IF('Data Input'!A10=0,\"\",'Data Input'!A10)","v":"Sample - please delete!"},{"$f":"IF(ISBLANK('Data Input'!A10),\"\",COUNTIF('Data Input'!C10:AA10,\"\"))","v":1},{"$f":"IF(ISBLANK('Data Input'!A10),\"\",COUNTIF('Data Input'!C10:AA10,\"0\"))","v":2},{"$f":"IF(ISBLANK('Data Input'!A10),\"\",SUM(B5,C5))","v":3},{"$f":"IF(ISBLANK('Data Input'!A10),\"\",SUM('Data Input'!C10:AA10))","v":22},{"$f":"IF(E5=\"\",\"\",E5/(COUNTA('Data Input'!$C$8:$AA$8)))","v":0.88},{"$f":"IF(ISBLANK('Data Input'!A10),\"\",SUM('Data Input'!C10,'Data Input'!F10,'Data Input'!G10,'Data Input'!J10,'Data Input'!L10,'Data Input'!O10,'Data Input'!Q10,'Data Input'!R10,'Data Input'!U10))","v":8},{"$f":"IF(G5=\"\",\"\",G5/COUNTIF('Data Input'!$C$8:$AA$8,\"+\"))","v":0.88888888888888884},{"$f":"IF(ISBLANK('Data Input'!A10),\"\",SUM('Data Input'!D10,'Data Input'!E10,'Data Input'!K10,'Data Input'!M10,'Data Input'!Y10))","v":5},{"$f":"IF(I5=\"\",\"\",I5/COUNTIF('Data Input'!$C$8:$AA$8,\"-\"))","v":1},{"$f":"IF(ISBLANK('Data Input'!A10),\"\",SUM('Data Input'!H10,'Data Input'!I10,'Data Input'!N10,'Data Input'!S10))","v":3},{"$f":"IF(K5=\"\",\"\",K5/COUNTIF('Data Input'!$C$8:$AA$8,\"x\"))","v":0.75},{"$f":"IF(ISBLANK('Data Input'!A10),\"\",SUM('Data Input'!P10,'Data Input'!V10,'Data Input'!W10))","v":3},{"$f":"IF(M5=\"\",\"\",M5/COUNTIF('Data Input'!$C$8:$AA$8,\"÷\"))","v":1},{"$f":"IF(ISBLANK('Data Input'!A10),\"\",SUM('Data Input'!T10,'Data Input'!X10,'Data Input'!Z10,'Data Input'!AA10))","v":3},{"$f":"IF(O5=\"\",\"\",O5/COUNTIF('Data Input'!$C$8:$AA$8,\"F\"))","v":0.75}]
[{"$f":"IF('Data Input'!A11=0,\"\",'Data Input'!A11)","v":""},{"$f":"IF(ISBLANK('Data Input'!A11),\"\",COUNTIF('Data Input'!C11:AA11,\"\"))","v":""},{"$f":"IF(ISBLANK('Data Input'!A11),\"\",COUNTIF('Data Input'!C11:AA11,\"0\"))","v":""},{"$f":"IF(ISBLANK('Data Input'!A11),\"\",SUM(B6,C6))","v":""},{"$f":"IF(ISBLANK('Data Input'!A11),\"\",SUM('Data Input'!C11:AA11))","v":""},{"$f":"IF(E6=\"\",\"\",E6/(COUNTA('Data Input'!$C$8:$AA$8)))","v":""},{"$f":"IF(ISBLANK('Data Input'!A11),\"\",SUM('Data Input'!C11,'Data Input'!F11,'Data Input'!G11,'Data Input'!J11,'Data Input'!L11,'Data Input'!O11,'Data Input'!Q11,'Data Input'!R11,'Data Input'!U11))","v":""},{"$f":"IF(G6=\"\",\"\",G6/COUNTIF('Data Input'!$C$8:$AA$8,\"+\"))","v":""},{"$f":"IF(ISBLANK('Data Input'!A11),\"\",SUM('Data Input'!D11,'Data Input'!E11,'Data Input'!K11,'Data Input'!M11,'Data Input'!Y11))","v":""},{"$f":"IF(I6=\"\",\"\",I6/COUNTIF('Data Input'!$C$8:$AA$8,\"-\"))","v":""},{"$f":"IF(ISBLANK('Data Input'!A11),\"\",SUM('Data Input'!H11,'Data Input'!I11,'Data Input'!N11,'Data Input'!S11))","v":""},{"$f":"IF(K6=\"\",\"\",K6/COUNTIF('Data Input'!$C$8:$AA$8,\"x\"))","v":""},{"$f":"IF(ISBLANK('Data Input'!A11),\"\",SUM('Data Input'!P11,'Data Input'!V11,'Data Input'!W11))","v":""},{"$f":"IF(M6=\"\",\"\",M6/COUNTIF('Data Input'!$C$8:$AA$8,\"÷\"))","v":""},{"$f":"IF(ISBLANK('Data Input'!A11),\"\",SUM('Data Input'!T11,'Data Input'!X11,'Data Input'!Z11,'Data Input'!AA11))","v":""},{"$f":"IF(O6=\"\",\"\",O6/COUNTIF('Data Input'!$C$8:$AA$8,\"F\"))","v":""}]
[{"$f":"IF('Data Input'!A12=0,\"\",'Data Input'!A12)","v":""},{"$f":"IF(ISBLANK('Data Input'!A12),\"\",COUNTIF('Data Input'!C12:AA12,\"\"))","v":""},{"$f":"IF(ISBLANK('Data Input'!A12),\"\",COUNTIF('Data Input'!C12:AA12,\"0\"))","v":""},{"$f":"IF(ISBLANK('Data Input'!A12),\"\",SUM(B7,C7))","v":""},{"$f":"IF(ISBLANK('Data Input'!A12),\"\",SUM('Data Input'!C12:AA12))","v":""},{"$f":"IF(E7=\"\",\"\",E7/(COUNTA('Data Input'!$C$8:$AA$8)))","v":""},{"$f":"IF(ISBLANK('Data Input'!A12),\"\",SUM('Data Input'!C12,'Data Input'!F12,'Data Input'!G12,'Data Input'!J12,'Data Input'!L12,'Data Input'!O12,'Data Input'!Q12,'Data Input'!R12,'Data Input'!U12))","v":""},{"$f":"IF(G7=\"\",\"\",G7/COUNTIF('Data Input'!$C$8:$AA$8,\"+\"))","v":""},{"$f":"IF(ISBLANK('Data Input'!A12),\"\",SUM('Data Input'!D12,'Data Input'!E12,'Data Input'!K12,'Data Input'!M12,'Data Input'!Y12))","v":""},{"$f":"IF(I7=\"\",\"\",I7/COUNTIF('Data Input'!$C$8:$AA$8,\"-\"))","v":""},{"$f":"IF(ISBLANK('Data Input'!A12),\"\",SUM('Data Input'!H12,'Data Input'!I12,'Data Input'!N12,'Data Input'!S12))","v":""},{"$f":"IF(K7=\"\",\"\",K7/COUNTIF('Data Input'!$C$8:$AA$8,\"x\"))","v":""},{"$f":"IF(ISBLANK('Data Input'!A12),\"\",SUM('Data Input'!P12,'Data Input'!V12,'Data Input'!W12))","v":""},{"$f":"IF(M7=\"\",\"\",M7/COUNTIF('Data Input'!$C$8:$AA$8,\"÷\"))","v":""},{"$f":"IF(ISBLANK('Data Input'!A12),\"\",SUM('Data Input'!T12,'Data Input'!X12,'Data Input'!Z12,'Data Input'!AA12))","v":""},{"$f":"IF(O7=\"\",\"\",O7/COUNTIF('Data Input'!$C$8:$AA$8,\"F\"))","v":""}]
[{"$f":"IF('Data Input'!A13=0,\"\",'Data Input'!A13)","v":""},{"$f":"IF(ISBLANK('Data Input'!A13),\"\",COUNTIF('Data Input'!C13:AA13,\"\"))","v":""},{"$f":"IF(ISBLANK('Data Input'!A13),\"\",COUNTIF('Data Input'!C13:AA13,\"0\"))","v":""},{"$f":"IF(ISBLANK('Data Input'!A13),\"\",SUM(B8,C8))","v":""},{"$f":"IF(ISBLANK('Data Input'!A13),\"\",SUM('Data Input'!C13:AA13))","v":""},{"$f":"IF(E8=\"\",\"\",E8/(COUNTA('Data Input'!$C$8:$AA$8)))","v":""},{"$f":"IF(ISBLANK('Data Input'!A13),\"\",SUM('Data Input'!C13,'Data Input'!F13,'Data Input'!G13,'Data Input'!J13,'Data Input'!L13,'Data Input'!O13,'Data Input'!Q13,'Data Input'!R13,'Data Input'!U13))","v":""},{"$f":"IF(G8=\"\",\"\",G8/COUNTIF('Data Input'!$C$8:$AA$8,\"+\"))","v":""},{"$f":"IF(ISBLANK('Data Input'!A13),\"\",SUM('Data Input'!D13,'Data Input'!E13,'Data Input'!K13,'Data Input'!M13,'Data Input'!Y13))","v":""},{"$f":"IF(I8=\"\",\"\",I8/COUNTIF('Data Input'!$C$8:$AA$8,\"-\"))","v":""},{"$f":"IF(ISBLANK('Data Input'!A13),\"\",SUM('Data Input'!H13,'Data Input'!I13,'Data Input'!N13,'Data Input'!S13))","v":""},{"$f":"IF(K8=\"\",\"\",K8/COUNTIF('Data Input'!$C$8:$AA$8,\"x\"))","v":""},{"$f":"IF(ISBLANK('Data Input'!A13),\"\",SUM('Data Input'!P13,'Data Input'!V13,'Data Input'!W13))","v":""},{"$f":"IF(M8=\"\",\"\",M8/COUNTIF('Data Input'!$C$8:$AA$8,\"÷\"))","v":""},{"$f":"IF(ISBLANK('Data Input'!A13),\"\",SUM('Data Input'!T13,'Data Input'!X13,'Data Input'!Z13,'Data Input'!AA13))","v":""},{"$f":"IF(O8=\"\",\"\",O8/COUNTIF('Data Input'!$C$8:$AA$8,\"F\"))","v":""}]
[{"$f":"IF('Data Input'!A14=0,\"\",'Data Input'!A14)","v":""},{"$f":"IF(ISBLANK('Data Input'!A14),\"\",COUNTIF('Data Input'!C14:AA14,\"\"))","v":""},{"$f":"IF(ISBLANK('Data Input'!A14),\"\",COUNTIF('Data Input'!C14:AA14,\"0\"))","v":""},{"$f":"IF(ISBLANK('Data Input'!A14),\"\",SUM(B9,C9))","v":""},{"$f":"IF(ISBLANK('Data Input'!A14),\"\",SUM('Data Input'!C14:AA14))","v":""},{"$f":"IF(E9=\"\",\"\",E9/(COUNTA('Data Input'!$C$8:$AA$8)))","v":""},{"$f":"IF(ISBLANK('Data Input'!A14),\"\",SUM('Data Input'!C14,'Data Input'!F14,'Data Input'!G14,'Data Input'!J14,'Data Input'!L14,'Data Input'!O14,'Data Input'!Q14,'Data Input'!R14,'Data Input'!U14))","v":""},{"$f":"IF(G9=\"\",\"\",G9/COUNTIF('Data Input'!$C$8:$AA$8,\"+\"))","v":""},{"$f":"IF(ISBLANK('Data Input'!A14),\"\",SUM('Data Input'!D14,'Data Input'!E14,'Data Input'!K14,'Data Input'!M14,'Data Input'!Y14))","v":""},{"$f":"IF(I9=\"\",\"\",I9/COUNTIF('Data Input'!$C$8:$AA$8,\"-\"))","v":""},{"$f":"IF(ISBLANK('Data Input'!A14),\"\",SUM('Data Input'!H14,'Data Input'!I14,'Data Input'!N14,'Data Input'!S14))","v":""},{"$f":"IF(K9=\"\",\"\",K9/COUNTIF('Data Input'!$C$8:$AA$8,\"x\"))","v":""},{"$f":"IF(ISBLANK('Data Input'!A14),\"\",SUM('Data Input'!P14,'Data Input'!V14,'Data Input'!W14))","v":""},{"$f":"IF(M9=\"\",\"\",M9/COUNTIF('Data Input'!$C$8:$AA$8,\"÷\"))","v":""},{"$f":"IF(ISBLANK('Data Input'!A14),\"\",SUM('Data Input'!T14,'Data Input'!X14,'Data Input'!Z14,'Data Input'!AA14))","v":""},{"$f":"IF(O9=\"\",\"\",O9/COUNTIF('Data Input'!$C$8:$AA$8,\"F\"))","v":""}]
[{"$f":"IF('Data Input'!A15=0,\"\",'Data Input'!A15)","v":""},{"$f":"IF(ISBLANK('Data Input'!A15),\"\",COUNTIF('Data Input'!C15:AA15,\"\"))","v":""},{"$f":"IF(ISBLANK('Data Input'!A15),\"\",COUNTIF('Data Input'!C15:AA15,\"0\"))","v":""},{"$f":"IF(ISBLANK('Data Input'!A15),\"\",SUM(B10,C10))","v":""},{"$f":"IF(ISBLANK('Data Input'!A15),\"\",SUM('Data Input'!C15:AA15))","v":""},{"$f":"IF(E10=\"\",\"\",E10/(COUNTA('Data Input'!$C$8:$AA$8)))","v":""},{"$f":"IF(ISBLANK('Data Input'!A15),\"\",SUM('Data Input'!C15,'Data Input'!F15,'Data Input'!G15,'Data Input'!J15,'Data Input'!L15,'Data Input'!O15,'Data Input'!Q15,'Data Input'!R15,'Data Input'!U15))","v":""},{"$f":"IF(G10=\"\",\"\",G10/COUNTIF('Data Input'!$C$8:$AA$8,\"+\"))","v":""},{"$f":"IF(ISBLANK('Data Input'!A15),\"\",SUM('Data Input'!D15,'Data Input'!E15,'Data Input'!K15,'Data Input'!M15,'Data Input'!Y15))","v":""},{"$f":"IF(I10=\"\",\"\",I10/COUNTIF('Data Input'!$C$8:$AA$8,\"-\"))","v":""},{"$f":"IF(ISBLANK('Data Input'!A15),\"\",SUM('Data Input'!H15,'Data Input'!I15,'Data Input'!N15,'Data Input'!S15))","v":""},{"$f":"IF(K10=\"\",\"\",K10/COUNTIF('Data Input'!$C$8:$AA$8,\"x\"))","v":""},{"$f":"IF(ISBLANK('Data Input'!A15),\"\",SUM('Data Input'!P15,'Data Input'!V15,'Data Input'!W15))","v":""},{"$f":"IF(M10=\"\",\"\",M10/COUNTIF('Data Input'!$C$8:$AA$8,\"÷\"))","v":""},{"$f":"IF(ISBLANK('Data Input'!A15),\"\",SUM('Data Input'!T15,'Data Input'!X15,'Data Input'!Z15,'Data Input'!AA15))","v":""},{"$f":"IF(O10=\"\",\"\",O10/COUNTIF('Data Input'!$C$8:$AA$8,\"F\"))","v":""}]
{"$rows_left_out":264}
{"sheet":"Cohort Summary","index":4,"n_rows":12,"n_cols":6,"rows_kept":12,"cut":false,"hidden":false,"merged":[[11,0,13,4]]}
["Class Averages:",{"$f":"'Pupil Summary'!G2","v":"+"},{"$f":"'Pupil Summary'!I2","v":"-"},{"$f":"'Pupil Summary'!K2","v":"x"},{"$f":"'Pupil Summary'!M2","v":"÷"},{"$f":"'Pupil Summary'!O2","v":"F"}]
["Class correct:",{"$f":"IF(ISERROR(B4/B3),\"\",(B4/B3))","v":0.88888888888888884},{"$f":"IF(ISERROR(C4/C3),\"\",(C4/C3))","v":1},{"$f":"IF(ISERROR(D4/D3),\"\",(D4/D3))","v":0.75},{"$f":"IF(ISERROR(E4/E3),\"\",(E4/E3))","v":1},{"$f":"IF(ISERROR(F4/F3),\"\",(F4/F3))","v":0.75}]
["Maximum",{"$f":"COUNTIF('Data Input'!$C$8:$AA$8,B1)","v":9},{"$f":"COUNTIF('Data Input'!$C$8:$AA$8,C1)","v":5},{"$f":"COUNTIF('Data Input'!$C$8:$AA$8,D1)","v":4},{"$f":"COUNTIF('Data Input'!$C$8:$AA$8,E1)","v":3},{"$f":"COUNTIF('Data Input'!$C$8:$AA$8,F1)","v":4}]
["Correct",{"$f":"IF(ISERROR(AVERAGE(IF(('Data Input'!$C$8:$AA$8=$B$1),'Data Input'!$C2:$AA2))*$B$3/COUNTA('Data Input'!$A$10:$A$278)),\"\",AVERAGE(IF(('Data Input'!$C$8:$AA$8=$B$1),'Data Input'!$C2:$AA2))*$B$3/COUNTA('Data Input'!$A$10:$A$278))","v":8},{"$f":"IF(ISERROR(AVERAGE(IF(('Data Input'!$C$8:$AA$8=$C$1),'Data Input'!$C2:$AA2))*$C$3/COUNTA('Data Input'!$A$10:$A$278)),\"\",AVERAGE(IF(('Data Input'!$C$8:$AA$8=$C$1),'Data Input'!$C2:$AA2))*$C$3/COUNTA('Data Input'!$A$10:$A$278))","v":5},{"$f":"IF(ISERROR(AVERAGE(IF(('Data Input'!$C$8:$AA$8=$D$1),'Data Input'!$C2:$AA2))*$D$3/COUNTA('Data Input'!$A$10:$A$278)),\"\",AVERAGE(IF(('Data Input'!$C$8:$AA$8=$D$1),'Data Input'!$C2:$AA2))*$D$3/COUNTA('Data Input'!$A$10:$A$278))","v":3},{"$f":"IF(ISERROR(AVERAGE(IF(('Data Input'!$C$8:$AA$8=$E$1),'Data Input'!$C2:$AA2))*$E$3/COUNTA('Data Input'!$A$10:$A$278)),\"\",AVERAGE(IF(('Data Input'!$C$8:$AA$8=$E$1),'Data Input'!$C2:$AA2))*$E$3/COUNTA('Data Input'!$A$10:$A$278))","v":3},{"$f":"IF(ISERROR(AVERAGE(IF(('Data Input'!$C$8:$AA$8=$F$1),'Data Input'!$C2:$AA2))*$F$3/COUNTA('Data Input'!$A$10:$A$278)),\"\",AVERAGE(IF(('Data Input'!$C$8:$AA$8=$F$1),'Data Input'!$C2:$AA2))*$F$3/COUNTA('Data Input'!$A$10:$A$278))","v":3}]
["Incorrect",{"$f":"IF(ISERROR(AVERAGE(IF(('Data Input'!$C$8:$AA$8=$B$1),'Data Input'!$C3:$AA3))*$B$3/COUNTA('Data Input'!$A$10:$A$278)),\"\",AVERAGE(IF(('Data Input'!$C$8:$AA$8=$B$1),'Data Input'!$C3:$AA3))*$B$3/COUNTA('Data Input'!$A$10:$A$278))","v":1},{"$f":"IF(ISERROR(AVERAGE(IF(('Data Input'!$C$8:$AA$8=$C$1),'Data Input'!$C3:$AA3))*$C$3/COUNTA('Data Input'!$A$10:$A$278)),\"\",AVERAGE(IF(('Data Input'!$C$8:$AA$8=$C$1),'Data Input'!$C3:$AA3))*$C$3/COUNTA('Data Input'!$A$10:$A$278))","v":0},{"$f":"IF(ISERROR(AVERAGE(IF(('Data Input'!$C$8:$AA$8=$D$1),'Data Input'!$C3:$AA3))*$D$3/COUNTA('Data Input'!$A$10:$A$278)),\"\",AVERAGE(IF(('Data Input'!$C$8:$AA$8=$D$1),'Data Input'!$C3:$AA3))*$D$3/COUNTA('Data Input'!$A$10:$A$278))","v":0},{"$f":"IF(ISERROR(AVERAGE(IF(('Data Input'!$C$8:$AA$8=$E$1),'Data Input'!$C3:$AA3))*$E$3/COUNTA('Data Input'!$A$10:$A$278)),\"\",AVERAGE(IF(('Data Input'!$C$8:$AA$8=$E$1),'Data Input'!$C3:$AA3))*$E$3/COUNTA('Data Input'!$A$10:$A$278))","v":0},{"$f":"IF(ISERROR(AVERAGE(IF(('Data Input'!$C$8:$AA$8=$F$1),'Data Input'!$C3:$AA3))*$F$3/COUNTA('Data Input'!$A$10:$A$278)),\"\",AVERAGE(IF(('Data Input'!$C$8:$AA$8=$F$1),'Data Input'!$C3:$AA3))*$F$3/COUNTA('Data Input'!$A$10:$A$278))","v":1}]
["Unanswered",{"$f":"IF(ISERROR(AVERAGE(IF(('Data Input'!$C$8:$AA$8=$B$1),'Data Input'!$C4:$AA4))*$B$3/COUNTA('Data Input'!$A$10:$A$278)),\"\",AVERAGE(IF(('Data Input'!$C$8:$AA$8=$B$1),'Data Input'!$C4:$AA4))*$B$3/COUNTA('Data Input'!$A$10:$A$278))","v":0},{"$f":"IF(ISERROR(AVERAGE(IF(('Data Input'!$C$8:$AA$8=$C$1),'Data Input'!$C4:$AA4))*$C$3/COUNTA('Data Input'!$A$10:$A$278)),\"\",AVERAGE(IF(('Data Input'!$C$8:$AA$8=$C$1),'Data Input'!$C4:$AA4))*$C$3/COUNTA('Data Input'!$A$10:$A$278))","v":0},{"$f":"IF(ISERROR(AVERAGE(IF(('Data Input'!$C$8:$AA$8=$D$1),'Data Input'!$C4:$AA4))*$D$3/COUNTA('Data Input'!$A$10:$A$278)),\"\",AVERAGE(IF(('Data Input'!$C$8:$AA$8=$D$1),'Data Input'!$C4:$AA4))*$D$3/COUNTA('Data Input'!$A$10:$A$278))","v":1},{"$f":"IF(ISERROR(AVERAGE(IF(('Data Input'!$C$8:$AA$8=$E$1),'Data Input'!$C4:$AA4))*$E$3/COUNTA('Data Input'!$A$10:$A$278)),\"\",AVERAGE(IF(('Data Input'!$C$8:$AA$8=$E$1),'Data Input'!$C4:$AA4))*$E$3/COUNTA('Data Input'!$A$10:$A$278))","v":0},{"$f":"IF(ISERROR(AVERAGE(IF(('Data Input'!$C$8:$AA$8=$F$1),'Data Input'!$C4:$AA4))*$F$3/COUNTA('Data Input'!$A$10:$A$278)),\"\",AVERAGE(IF(('Data Input'!$C$8:$AA$8=$F$1),'Data Input'!$C4:$AA4))*$F$3/COUNTA('Data Input'!$A$10:$A$278))","v":0}]
["Incorrect or unanswered",{"$f":"IF(ISERROR(SUM(B5,B6)),\"\",SUM(B5,B6))","v":1},{"$f":"IF(ISERROR(SUM(C5,C6)),\"\",SUM(C5,C6))","v":0},{"$f":"IF(ISERROR(SUM(D5,D6)),\"\",SUM(D5,D6))","v":1},{"$f":"IF(ISERROR(SUM(E5,E6)),\"\",SUM(E5,E6))","v":0},{"$f":"IF(ISERROR(SUM(F5,F6)),\"\",SUM(F5,F6))","v":1}]
[]
[{"$f":"\"Average Total Score \"&COUNTA('Data Input'!C8:AA8)","v":"Average Total Score 25"},"Total"]
[{"$f":"IF(ISERROR(AVERAGE('Pupil Summary'!E5:E273)),\"\",AVERAGE('Pupil Summary'!E5:E273))","v":22},{"$f":"IF(ISERROR(A10/COUNTA('Data Input'!C8:AA8)-1),\"\",A10/(COUNTA('Data Input'!C8:AA8)))","v":0.88}]
{"$rows_left_out":3}
{"sheet":"Strand Summary","index":5,"n_rows":28,"n_cols":2,"rows_kept":28,"cut":false,"hidden":false,"merged":[[26,1,26,11],[27,1,27,11]]}
[]
[]
[]
[]
[]
[]
[]
[]
[]
[]
{"$rows_left_out":19}
{"sheet":"Questions by Strand","index":6,"n_rows":0,"n_cols":0,"rows_kept":0,"cut":false,"hidden":false,"merged":[[45,0,46,17]]}

{"sheet":"Questions by Correct","index":7,"n_rows":0,"n_cols":0,"rows_kept":0,"cut":false,"hidden":false,"merged":[[45,0,46,17]]}

{"sheet":"Questions by Sub Type","index":8,"n_rows":0,"n_cols":0,"rows_kept":0,"cut":false,"hidden":false,"merged":[[45,0,46,17]]}