{"text_format":"1","workbook":"xlsx","n_sheets":9,"sheets":["Welcome","Data Input","P1 Hidden Data Tables","Pupil Summary","Cohort Summary","Strand Summary","Questions by Strand","Questions by Correct","Questions by Sub Type"],"not_rendered":{"charts":6,"images":1,"macros":1,"external_links":0,"defined_names":10,"comments":0,"pivot_tables":0},"unopened":[],"bounds":{"document_bytes":16777216,"sheet_cells":100000,"rows_first":2000,"rows_last":500,"rows_between":2000,"halvings":0,"cell_chars":16384,"cell_head_chars":4096},"cells_cut":0,"cells_raw":0,"read":"whole","date_system":"1900"}

{"sheet":"Welcome","index":0,"n_rows":23,"n_cols":11,"rows_kept":23,"cut":false,"hidden":false,"merged":[[1,3,1,12]]}
[]
[null,null,null,"2016 KS1 Mathematics Arithmetic Analysis"]
[]
[]
[]
[]
[]
[]
[]
[]
[]
[]
[]
[]
[]
[]
[]
[]
[]
[]
[]
[]
[null,null,null,null,null,null,null,null,null,null,"© 2016 Primary Tools.co.uk"]

{"sheet":"Data Input","index":1,"n_rows":10,"n_cols":27,"rows_kept":10,"cut":false,"hidden":false,"merged":[[0,1,4,1]]}
["Question","Mental",1,2,3,4,5,6,7,8,9,10,11,12,13,14,15,16,17,18,19,20,21,22,23,24,25]
["Group Correct",null,{"$f":"COUNTIF(C10:C278,1)","v":1},{"$f":"COUNTIF(D10:D278,1)","v":1},1,1,1,1,1,0,1,1,1,0,1,1,1,1,1,1,1,1,{"$f":"COUNTIF(W10:W278,1)","v":1},{"$f":"COUNTIF(X10:X278,1)","v":1},{"$f":"COUNTIF(Y10:Y278,1)","v":1},{"$f":"COUNTIF(Z10:Z278,1)","v":0},{"$f":"COUNTIF(AA10:AA278,1)","v":1}]
["Group Incorrect",null,{"$f":"COUNTIF(C10:C278,0)","v":0},{"$f":"COUNTIF(D10:D278,0)","v":0},0,0,0,0,0,1,0,0,0,0,0,0,0,0,0,0,0,0,{"$f":"COUNTIF(W10:W278,0)","v":0},{"$f":"COUNTIF(X10:X278,0)","v":0},{"$f":"COUNTIF(Y10:Y278,0)","v":0},{"$f":"COUNTIF(Z10:Z278,0)","v":1},{"$f":"COUNTIF(AA10:AA278,0)","v":0}]
["Group Unanswered",null,{"$f":"COUNTA($A$10:$A$278)-(SUM(C2:C3))","v":0},0,0,0,0,0,0,0,0,{"$f":"COUNTA($A$10:$A$278)-(SUM(L2:L3))","v":0},{"$f":"COUNTA($A$10:$A$278)-(SUM(M2:M3))","v":0},1,0,0,0,0,0,0,0,0,{"$f":"COUNTA($A$10:$A$278)-(SUM(W2:W3))","v":0},{"$f":"COUNTA($A$10:$A$278)-(SUM(X2:X3))","v":0},{"$f":"COUNTA($A$10:$A$278)-(SUM(Y2:Y3))","v":0},{"$f":"COUNTA($A$10:$A$278)-(SUM(Z2:Z3))","v":0},{"$f":"COUNTA($A$10:$A$278)-(SUM(AA2:AA3))","v":0}]
["Incorrect or unanswered",null,{"$f":"SUM(C3,C4)","v":0},{"$f":"SUM(D3,D4)","v":0},0,0,0,0,0,1,0,0,0,1,0,0,0,0,0,0,0,0,{"$f":"SUM(W3,W4)","v":0},{"$f":"SUM(X3,X4)","v":0},{"$f":"SUM(Y3,Y4)","v":0},{"$f":"SUM(Z3,Z4)","v":1},{"$f":"SUM(AA3,AA4)","v":0}]
["1 = correct, 0 = incorrect, blank = unanswered\n\n+: Addition\n-: Subtraction\nx: Multipliction\n÷: Division\nF:  Fraction\nI: Inverse required\nM: Multi Step",null,"8 + 6","12 - 7","10 - __ = 2","52 + 7","4 + 5 + 6","9 x 10 =","3 x 2 =","50 + __ = 80","56 - __ = 51","10 + 40 + 20 =","63 - 10 - 10 =","8 x 5 =","21 + 40 =","8 ÷ 2 = ","28 + __ = 35","69 + 11 =","6 x 3 =","1/2 of 16 =","55 + 17 =","40 ÷ 10 =","55 ÷ 5 = ","1/4 of 12 = ","71 - 14 = ","1/3 of 30 =","3/4 of 20 ="]
["Sub category","Sub","","","I","","M","","","I","I","M","M","","","","I","","","","","","","","I","",""]
["Name:         Prime Strand:","Prime","+","-","-","+","+","x","x","+","-","+","-","x","+","÷","+","+","x","F","+","÷","÷","F","-","F","F"]
[]
["Sample - please delete!",null,1,1,1,1,1,1,1,0,1,1,1,null,1,1,1,1,1,1,1,1,1,1,1,0,1]

{"sheet":"P1 Hidden Data Tables","index":2,"n_rows":129,"n_cols":22,"rows_kept":129,"cut":false,"hidden":true,"merged":[]}
[null,"In order of question"]
[null,"Strand","Question Number","Sub Category","Short Q","Correct","Incorrect or Unanswered","Incorrect","Unanswered"]
["C",{"$f":"'Data Input'!$C$8","v":"+"},{"$f":"'Data Input'!$C$1","v":1},{"$f":"'Data Input'!$C$7","v":""},{"$f":"'Data Input'!$C$6","v":"8 + 6"},{"$f":"'Data Input'!$C$2","v":1},{"$f":"'Data Input'!$C$5","v":0},{"$f":"'Data Input'!$C$3","v":0},{"$f":"'Data Input'!$C$4","v":0},null,null,null,"Codes"]
["D",{"$f":"'Data Input'!$D$8","v":"-"},{"$f":"'Data Input'!$D$1","v":2},{"$f":"'Data Input'!$D$7","v":""},{"$f":"'Data Input'!$D$6","v":"12 - 7"},{"$f":"'Data Input'!$D$2","v":1},{"$f":"'Data Input'!$D$5","v":0},{"$f":"'Data Input'!$D$3","v":0},{"$f":"'Data Input'!$D$4","v":0}]
["E",{"$f":"'Data Input'!$E$8","v":"-"},{"$f":"'Data Input'!$E$1","v":3},{"$f":"'Data Input'!$E$7","v":"I"},{"$f":"'Data Input'!$E$6","v":"10 - __ = 2"},{"$f":"'Data Input'!$E$2","v":1},{"$f":"'Data Input'!$E$5","v":0},{"$f":"'Data Input'!$E$3","v":0},{"$f":"'Data Input'!$E$4","v":0}]
["F",{"$f":"'Data Input'!$F$8","v":"+"},{"$f":"'Data Input'!$F$1","v":4},{"$f":"'Data Input'!$F$7","v":""},{"$f":"'Data Input'!$F$6","v":"52 + 7"},{"$f":"'Data Input'!$F$2","v":1},{"$f":"'Data Input'!$F$5","v":0},{"$f":"'Data Input'!$F$3","v":0},{"$f":"'Data Input'!$F$4","v":0}]
["G",{"$f":"'Data Input'!$G$8","v":"+"},{"$f":"'Data Input'!$G$1","v":5},{"$f":"'Data Input'!$G$7","v":"M"},{"$f":"'Data Input'!$G$6","v":"4 + 5 + 6"},{"$f":"'Data Input'!$G$2","v":1},{"$f":"'Data Input'!$G$5","v":0},{"$f":"'Data Input'!$G$3","v":0},{"$f":"'Data Input'!$G$4","v":0}]
["H",{"$f":"'Data Input'!$H$8","v":"x"},{"$f":"'Data Input'!$H$1","v":6},{"$f":"'Data Input'!$H$7","v":""},{"$f":"'Data Input'!$H$6","v":"9 x 10 ="},{"$f":"'Data Input'!$H$2","v":1},{"$f":"'Data Input'!$H$5","v":0},{"$f":"'Data Input'!$H$3","v":0},{"$f":"'Data Input'!$H$4","v":0}]
["I",{"$f":"'Data Input'!$I$8","v":"x"},{"$f":"'Data Input'!$I$1","v":7},{"$f":"'Data Input'!$I$7","v":""},{"$f":"'Data Input'!$I$6","v":"3 x 2 ="},{"$f":"'Data Input'!$I$2","v":1},{"$f":"'Data Input'!$I$5","v":0},{"$f":"'Data Input'!$I$3","v":0},{"$f":"'Data Input'!$I$4","v":0}]
["J",{"$f":"'Data Input'!$J$8","v":"+"},{"$f":"'Data Input'!$J$1","v":8},{"$f":"'Data Input'!$J$7","v":"I"},{"$f":"'Data Input'!$J$6","v":"50 + __ = 80"},{"$f":"'Data Input'!$J$2","v":0},{"$f":"'Data Input'!$J$5","v":1},{"$f":"'Data Input'!$J$3","v":1},{"$f":"'Data Input'!$J$4","v":0}]
["K",{"$f":"'Data Input'!$K$8","v":"-"},{"$f":"'Data Input'!$K$1","v":9},{"$f":"'Data Input'!$K$7","v":"I"},{"$f":"'Data Input'!$K$6","v":"56 - __ = 51"},{"$f":"'Data Input'!$K$2","v":1},{"$f":"'Data Input'!$K$5","v":0},{"$f":"'Data Input'!$K$3","v":0},{"$f":"'Data Input'!$K$4","v":0}]
["L",{"$f":"'Data Input'!$L$8","v":"+"},{"$f":"'Data Input'!$L$1","v":10},{"$f":"'Data Input'!$L$7","v":"M"},{"$f":"'Data Input'!$L$6","v":"10 + 40 + 20 ="},{"$f":"'Data Input'!$L$2","v":1},{"$f":"'Data Input'!$L$5","v":0},{"$f":"'Data Input'!$L$3","v":0},{"$f":"'Data Input'!$L$4","v":0}]
["M",{"$f":"'Data Input'!$M$8","v":"-"},{"$f":"'Data Input'!$M$1","v":11},{"$f":"'Data Input'!$M$7","v":"M"},{"$f":"'Data Input'!$M$6","v":"63 - 10 - 10 ="},{"$f":"'Data Input'!$M$2","v":1},{"$f":"'Data Input'!$M$5","v":0},{"$f":"'Data Input'!$M$3","v":0},{"$f":"'Data Input'!$M$4","v":0}]
["N",{"$f":"'Data Input'!$N$8","v":"x"},{"$f":"'Data Input'!$N$1","v":12},{"$f":"'Data Input'!$N$7","v":""},{"$f":"'Data Input'!$N$6","v":"8 x 5 ="},{"$f":"'Data Input'!$N$2","v":0},{"$f":"'Data Input'!$N$5","v":1},{"$f":"'Data Input'!$N$3","v":0},{"$f":"'Data Input'!$N$4","v":1}]
["O",{"$f":"'Data Input'!$O$8","v":"+"},{"$f":"'Data Input'!$O$1","v":13},{"$f":"'Data Input'!$O$7","v":""},{"$f":"'Data Input'!$O$6","v":"21 + 40 ="},{"$f":"'Data Input'!$O$2","v":1},{"$f":"'Data Input'!$O$5","v":0},{"$f":"'Data Input'!$O$3","v":0},{"$f":"'Data Input'!$O$4","v":0}]
["P",{"$f":"'Data Input'!$P$8","v":"÷"},{"$f":"'Data Input'!$P$1","v":14},{"$f":"'Data Input'!$P$7","v":""},{"$f":"'Data Input'!$P$6","v":"8 ÷ 2 = "},{"$f":"'Data Input'!$P$2","v":1},{"$f":"'Data Input'!$P$5","v":0},{"$f":"'Data Input'!$P$3","v":0},{"$f":"'Data Input'!$P$4","v":0}]
["Q",{"$f":"'Data Input'!$Q$8","v":"+"},{"$f":"'Data Input'!$Q$1","v":15},{"$f":"'Data Input'!$Q$7","v":"I"},{"$f":"'Data Input'!$Q$6","v":"28 + __ = 35"},{"$f":"'Data Input'!$Q$2","v":1},{"$f":"'Data Input'!$Q$5","v":0},{"$f":"'Data Input'!$Q$3","v":0},{"$f":"'Data Input'!$Q$4","v":0}]
["R",{"$f":"'Data Input'!$R$8","v":"+"},{"$f":"'Data Input'!$R$1","v":16},{"$f":"'Data Input'!$R$7","v":""},{"$f":"'Data Input'!$R$6","v":"69 + 11 ="},{"$f":"'Data Input'!$R$2","v":1},{"$f":"'Data Input'!$R$5","v":0},{"$f":"'Data Input'!$R$3","v":0},{"$f":"'Data Input'!$R$4","v":0}]
["S",{"$f":"'Data Input'!$S$8","v":"x"},{"$f":"'Data Input'!$S$1","v":17},{"$f":"'Data Input'!$S$7","v":""},{"$f":"'Data Input'!$S$6","v":"6 x 3 ="},{"$f":"'Data Input'!$S$2","v":1},{"$f":"'Data Input'!$S$5","v":0},{"$f":"'Data Input'!$S$3","v":0},{"$f":"'Data Input'!$S$4","v":0}]
["T",{"$f":"'Data Input'!$T$8","v":"F"},{"$f":"'Data Input'!$T$1","v":18},{"$f":"'Data Input'!$T$7","v":""},{"$f":"'Data Input'!$T$6","v":"1/2 of 16 ="},{"$f":"'Data Input'!$T$2","v":1},{"$f":"'Data Input'!$T$5","v":0},{"$f":"'Data Input'!$T$3","v":0},{"$f":"'Data Input'!$T$4","v":0}]
["U",{"$f":"'Data Input'!$U$8","v":"+"},{"$f":"'Data Input'!$U$1","v":19},{"$f":"'Data Input'!$U$7","v":""},{"$f":"'Data Input'!$U$6","v":"55 + 17 ="},{"$f":"'Data Input'!$U$2","v":1},{"$f":"'Data Input'!$U$5","v":0},{"$f":"'Data Input'!$U$3","v":0},{"$f":"'Data Input'!$U$4","v":0}]
["V",{"$f":"'Data Input'!$V$8","v":"÷"},{"$f":"'Data Input'!$V$1","v":20},{"$f":"'Data Input'!$V$7","v":""},{"$f":"'Data Input'!$V$6","v":"40 ÷ 10 ="},{"$f":"'Data Input'!$V$2","v":1},{"$f":"'Data Input'!$V$5","v":0},{"$f":"'Data Input'!$V$3","v":0},{"$f":"'Data Input'!$V$4","v":0}]
["W",{"$f":"'Data Input'!$W$8","v":"÷"},{"$f":"'Data Input'!$W$1","v":21},{"$f":"'Data Input'!$W$7","v":""},{"$f":"'Data Input'!$W$6","v":"55 ÷ 5 = "},{"$f":"'Data Input'!$W$2","v":1},{"$f":"'Data Input'!$W$5","v":0},{"$f":"'Data Input'!$W$3","v":0},{"$f":"'Data Input'!$W$4","v":0}]
["X",{"$f":"'Data Input'!$X$8","v":"F"},{"$f":"'Data Input'!$X$1","v":22},{"$f":"'Data Input'!$X$7","v":""},{"$f":"'Data Input'!$X$6","v":"1/4 of 12 = "},{"$f":"'Data Input'!$X$2","v":1},{"$f":"'Data Input'!$X$5","v":0},{"$f":"'Data Input'!$X$3","v":0},{"$f":"'Data Input'!$X$4","v":0}]
["Y",{"$f":"'Data Input'!$Y$8","v":"-"},{"$f":"'Data Input'!$Y$1","v":23},{"$f":"'Data Input'!$Y$7","v":"I"},{"$f":"'Data Input'!$Y$6","v":"71 - 14 = "},{"$f":"'Data Input'!$Y$2","v":1},{"$f":"'Data Input'!$Y$5","v":0},{"$f":"'Data Input'!$Y$3","v":0},{"$f":"'Data Input'!$Y$4","v":0}]
["Z",{"$f":"'Data Input'!$Z$8","v":"F"},{"$f":"'Data Input'!$Z$1","v":24},{"$f":"'Data Input'!$Z$7","v":""},{"$f":"'Data Input'!$Z$6","v":"1/3 of 30 ="},{"$f":"'Data Input'!$Z$2","v":0},{"$f":"'Data Input'!$Z$5","v":1},{"$f":"'Data Input'!$Z$3","v":1},{"$f":"'Data Input'!$Z$4","v":0}]
["AA",{"$f":"'Data Input'!$AA$8","v":"F"},{"$f":"'Data Input'!$AA$1","v":25},{"$f":"'Data Input'!$AA$7","v":""},{"$f":"'Data Input'!$AA$6","v":"3/4 of 20 ="},{"$f":"'Data Input'!$AA$2","v":1},{"$f":"'Data Input'!$AA$5","v":0},{"$f":"'Data Input'!$AA$3","v":0},{"$f":"'Data Input'!$AA$4","v":0}]
[]
[]
[null,"Sorted by Strand"]
[null,"Strand","Question Number","Sub Category","Short Q","Correct","Incorrect or Unanswered","Incorrect","Unanswered"]
["I",{"$f":"'Data Input'!$C$8","v":"+"},{"$f":"'Data Input'!$C$1","v":1},{"$f":"'Data Input'!$C$7","v":""},{"$f":"'Data Input'!$C$6","v":"8 + 6"},{"$f":"'Data Input'!$C$2","v":1},{"$f":"'Data Input'!$C$5","v":0},{"$f":"'Data Input'!$C$3","v":0},{"$f":"'Data Input'!$C$4","v":0},null,null,null,"Codes"]
["C",{"$f":"'Data Input'!$F$8","v":"+"},{"$f":"'Data Input'!$F$1","v":4},{"$f":"'Data Input'!$F$7","v":""},{"$f":"'Data Input'!$F$6","v":"52 + 7"},{"$f":"'Data Input'!$F$2","v":1},{"$f":"'Data Input'!$F$5","v":0},{"$f":"'Data Input'!$F$3","v":0},{"$f":"'Data Input'!$F$4","v":0}]
["AO",{"$f":"'Data Input'!$O$8","v":"+"},{"$f":"'Data Input'!$O$1","v":13},{"$f":"'Data Input'!$O$7","v":""},{"$f":"'Data Input'!$O$6","v":"21 + 40 ="},{"$f":"'Data Input'!$O$2","v":1},{"$f":"'Data Input'!$O$5","v":0},{"$f":"'Data Input'!$O$3","v":0},{"$f":"'Data Input'!$O$4","v":0}]
["R",{"$f":"'Data Input'!$R$8","v":"+"},{"$f":"'Data Input'!$R$1","v":16},{"$f":"'Data Input'!$R$7","v":""},{"$f":"'Data Input'!$R$6","v":"69 + 11 ="},{"$f":"'Data Input'!$R$2","v":1},{"$f":"'Data Input'!$R$5","v":0},{"$f":"'Data Input'!$R$3","v":0},{"$f":"'Data Input'!$R$4","v":0}]
["AJ",{"$f":"'Data Input'!$U$8","v":"+"},{"$f":"'Data Input'!$U$1","v":19},{"$f":"'Data Input'!$U$7","v":""},{"$f":"'Data Input'!$U$6","v":"55 + 17 ="},{"$f":"'Data Input'!$U$2","v":1},{"$f":"'Data Input'!$U$5","v":0},{"$f":"'Data Input'!$U$3","v":0},{"$f":"'Data Input'!$U$4","v":0}]
["AA",{"$f":"'Data Input'!$J$8","v":"+"},{"$f":"'Data Input'!$J$1","v":8},{"$f":"'Data Input'!$J$7","v":"I"},{"$f":"'Data Input'!$J$6","v":"50 + __ = 80"},{"$f":"'Data Input'!$J$2","v":0},{"$f":"'Data Input'!$J$5","v":1},{"$f":"'Data Input'!$J$3","v":1},{"$f":"'Data Input'!$J$4","v":0}]
["M",{"$f":"'Data Input'!$Q$8","v":"+"},{"$f":"'Data Input'!$Q$1","v":15},{"$f":"'Data Input'!$Q$7","v":"I"},{"$f":"'Data Input'!$Q$6","v":"28 + __ = 35"},{"$f":"'Data Input'!$Q$2","v":1},{"$f":"'Data Input'!$Q$5","v":0},{"$f":"'Data Input'!$Q$3","v":0},{"$f":"'Data Input'!$Q$4","v":0}]
["AF",{"$f":"'Data Input'!$G$8","v":"+"},{"$f":"'Data Input'!$G$1","v":5},{"$f":"'Data Input'!$G$7","v":"M"},{"$f":"'Data Input'!$G$6","v":"4 + 5 + 6"},{"$f":"'Data Input'!$G$2","v":1},{"$f":"'Data Input'!$G$5","v":0},{"$f":"'Data Input'!$G$3","v":0},{"$f":"'Data Input'!$G$4","v":0}]
["AL",{"$f":"'Data Input'!$L$8","v":"+"},{"$f":"'Data Input'!$L$1","v":10},{"$f":"'Data Input'!$L$7","v":"M"},{"$f":"'Data Input'!$L$6","v":"10 + 40 + 20 ="},{"$f":"'Data Input'!$L$2","v":1},{"$f":"'Data Input'!$L$5","v":0},{"$f":"'Data Input'!$L$3","v":0},{"$f":"'Data Input'!$L$4","v":0}]
[]
["AE",{"$f":"'Data Input'!$D$8","v":"-"},{"$f":"'Data Input'!$D$1","v":2},{"$f":"'Data Input'!$D$7","v":""},{"$f":"'Data Input'!$D$6","v":"12 - 7"},{"$f":"'Data Input'!$D$2","v":1},{"$f":"'Data Input'!$D$5","v":0},{"$f":"'Data Input'!$D$3","v":0},{"$f":"'Data Input'!$D$4","v":0}]
["P",{"$f":"'Data Input'!$E$8","v":"-"},{"$f":"'Data Input'!$E$1","v":3},{"$f":"'Data Input'!$E$7","v":"I"},{"$f":"'Data Input'!$E$6","v":"10 - __ = 2"},{"$f":"'Data Input'!$E$2","v":1},{"$f":"'Data Input'!$E$5","v":0},{"$f":"'Data Input'!$E$3","v":0},{"$f":"'Data Input'!$E$4","v":0}]
["L",{"$f":"'Data Input'!$K$8","v":"-"},{"$f":"'Data Input'!$K$1","v":9},{"$f":"'Data Input'!$K$7","v":"I"},{"$f":"'Data Input'!$K$6","v":"56 - __ = 51"},{"$f":"'Data Input'!$K$2","v":1},{"$f":"'Data Input'!$K$5","v":0},{"$f":"'Data Input'!$K$3","v":0},{"$f":"'Data Input'!$K$4","v":0}]
["S",{"$f":"'Data Input'!$Y$8","v":"-"},{"$f":"'Data Input'!$Y$1","v":23},{"$f":"'Data Input'!$Y$7","v":"I"},{"$f":"'Data Input'!$Y$6","v":"71 - 14 = "},{"$f":"'Data Input'!$Y$2","v":1},{"$f":"'Data Input'!$Y$5","v":0},{"$f":"'Data Input'!$Y$3","v":0},{"$f":"'Data Input'!$Y$4","v":0}]
["V",{"$f":"'Data Input'!$M$8","v":"-"},{"$f":"'Data Input'!$M$1","v":11},{"$f":"'Data Input'!$M$7","v":"M"},{"$f":"'Data Input'!$M$6","v":"63 - 10 - 10 ="},{"$f":"'Data Input'!$M$2","v":1},{"$f":"'Data Input'!$M$5","v":0},{"$f":"'Data Input'!$M$3","v":0},{"$f":"'Data Input'!$M$4","v":0}]
[]
["X",{"$f":"'Data Input'!$I$8","v":"x"},{"$f":"'Data Input'!$I$1","v":7},{"$f":"'Data Input'!$I$7","v":""},{"$f":"'Data Input'!$I$6","v":"3 x 2 ="},{"$f":"'Data Input'!$I$2","v":1},{"$f":"'Data Input'!$I$5","v":0},{"$f":"'Data Input'!$I$3","v":0},{"$f":"'Data Input'!$I$4","v":0}]
["E",{"$f":"'Data Input'!$N$8","v":"x"},{"$f":"'Data Input'!$N$1","v":12},{"$f":"'Data Input'!$N$7","v":""},{"$f":"'Data Input'!$N$6","v":"8 x 5 ="},{"$f":"'Data Input'!$N$2","v":0},{"$f":"'Data Input'!$N$5","v":1},{"$f":"'Data Input'!$N$3","v":0},{"$f":"'Data Input'!$N$4","v":1}]
["G",{"$f":"'Data Input'!$H$8","v":"x"},{"$f":"'Data Input'!$H$1","v":6},{"$f":"'Data Input'!$H$7","v":""},{"$f":"'Data Input'!$H$6","v":"9 x 10 ="},{"$f":"'Data Input'!$H$2","v":1},{"$f":"'Data Input'!$H$5","v":0},{"$f":"'Data Input'!$H$3","v":0},{"$f":"'Data Input'!$H$4","v":0}]
["W",{"$f":"'Data Input'!$S$8","v":"x"},{"$f":"'Data Input'!$S$1","v":17},{"$f":"'Data Input'!$S$7","v":""},{"$f":"'Data Input'!$S$6","v":"6 x 3 ="},{"$f":"'Data Input'!$S$2","v":1},{"$f":"'Data Input'!$S$5","v":0},{"$f":"'Data Input'!$S$3","v":0},{"$f":"'Data Input'!$S$4","v":0}]
[]
["H",{"$f":"'Data Input'!$P$8","v":"÷"},{"$f":"'Data Input'!$P$1","v":14},{"$f":"'Data Input'!$P$7","v":""},{"$f":"'Data Input'!$P$6","v":"8 ÷ 2 = "},{"$f":"'Data Input'!$P$2","v":1},{"$f":"'Data Input'!$P$5","v":0},{"$f":"'Data Input'!$P$3","v":0},{"$f":"'Data Input'!$P$4","v":0}]
["J",{"$f":"'Data Input'!$V$8","v":"÷"},{"$f":"'Data Input'!$V$1","v":20},{"$f":"'Data Input'!$V$7","v":""},{"$f":"'Data Input'!$V$6","v":"40 ÷ 10 ="},{"$f":"'Data Input'!$V$2","v":1},{"$f":"'Data Input'!$V$5","v":0},{"$f":"'Data Input'!$V$3","v":0},{"$f":"'Data Input'!$V$4","v":0}]
["AP",{"$f":"'Data Input'!$W$8","v":"÷"},{"$f":"'Data Input'!$W$1","v":21},{"$f":"'Data Input'!$W$7","v":""},{"$f":"'Data Input'!$W$6","v":"55 ÷ 5 = "},{"$f":"'Data Input'!$W$2","v":1},{"$f":"'Data Input'!$W$5","v":0},{"$f":"'Data Input'!$W$3","v":0},{"$f":"'Data Input'!$W$4","v":0}]
[]
["AK",{"$f":"'Data Input'!$T$8","v":"F"},{"$f":"'Data Input'!$T$1","v":18},{"$f":"'Data Input'!$T$7","v":""},{"$f":"'Data Input'!$T$6","v":"1/2 of 16 ="},{"$f":"'Data Input'!$T$2","v":1},{"$f":"'Data Input'!$T$5","v":0},{"$f":"'Data Input'!$T$3","v":0},{"$f":"'Data Input'!$T$4","v":0}]
["U",{"$f":"'Data Input'!$X$8","v":"F"},{"$f":"'Data Input'!$X$1","v":22},{"$f":"'Data Input'!$X$7","v":""},{"$f":"'Data Input'!$X$6","v":"1/4 of 12 = "},{"$f":"'Data Input'!$X$2","v":1},{"$f":"'Data Input'!$X$5","v":0},{"$f":"'Data Input'!$X$3","v":0},{"$f":"'Data Input'!$X$4","v":0}]
["AB",{"$f":"'Data Input'!$Z$8","v":"F"},{"$f":"'Data Input'!$Z$1","v":24},{"$f":"'Data Input'!$Z$7","v":""},{"$f":"'Data Input'!$Z$6","v":"1/3 of 30 ="},{"$f":"'Data Input'!$Z$2","v":0},{"$f":"'Data Input'!$Z$5","v":1},{"$f":"'Data Input'!$Z$3","v":1},{"$f":"'Data Input'!$Z$4","v":0}]
["AC",{"$f":"'Data Input'!$AA$8","v":"F"},{"$f":"'Data Input'!$AA$1","v":25},{"$f":"'Data Input'!$AA$7","v":""},{"$f":"'Data Input'!$AA$6","v":"3/4 of 20 ="},{"$f":"'Data Input'!$AA$2","v":1},{"$f":"'Data Input'!$AA$5","v":0},{"$f":"'Data Input'!$AA$3","v":0},{"$f":"'Data Input'!$AA$4","v":0}]
[]
[]
[]
[]
[]
[]
[]
[]
[]
[]
[null,"Sorted by sub strand"]
[null,"Strand","Question Number","Sub Category","Short Q","Correct","Incorrect or Unanswered","Incorrect","Unanswered"]
["C",{"$f":"'Data Input'!$C$8","v":"+"},{"$f":"'Data Input'!$C$1","v":1},{"$f":"'Data Input'!$C$7","v":""},{"$f":"'Data Input'!$C$6","v":"8 + 6"},{"$f":"'Data Input'!$C$2","v":1},{"$f":"'Data Input'!$C$5","v":0},{"$f":"'Data Input'!$C$3","v":0},{"$f":"'Data Input'!$C$4","v":0}]
["M",{"$f":"'Data Input'!$U$8","v":"+"},{"$f":"'Data Input'!$U$1","v":19},{"$f":"'Data Input'!$U$7","v":""},{"$f":"'Data Input'!$U$6","v":"55 + 17 ="},{"$f":"'Data Input'!$U$2","v":1},{"$f":"'Data Input'!$U$5","v":0},{"$f":"'Data Input'!$U$3","v":0},{"$f":"'Data Input'!$U$4","v":0}]
["W",{"$f":"'Data Input'!$F$8","v":"+"},{"$f":"'Data Input'!$F$1","v":4},{"$f":"'Data Input'!$F$7","v":""},{"$f":"'Data Input'!$F$6","v":"52 + 7"},{"$f":"'Data Input'!$F$2","v":1},{"$f":"'Data Input'!$F$5","v":0},{"$f":"'Data Input'!$F$3","v":0},{"$f":"'Data Input'!$F$4","v":0}]
["X",{"$f":"'Data Input'!$O$8","v":"+"},{"$f":"'Data Input'!$O$1","v":13},{"$f":"'Data Input'!$O$7","v":""},{"$f":"'Data Input'!$O$6","v":"21 + 40 ="},{"$f":"'Data Input'!$O$2","v":1},{"$f":"'Data Input'!$O$5","v":0},{"$f":"'Data Input'!$O$3","v":0},{"$f":"'Data Input'!$O$4","v":0}]
["J",{"$f":"'Data Input'!$R$8","v":"+"},{"$f":"'Data Input'!$R$1","v":16},{"$f":"'Data Input'!$R$7","v":""},{"$f":"'Data Input'!$R$6","v":"69 + 11 ="},{"$f":"'Data Input'!$R$2","v":1},{"$f":"'Data Input'!$R$5","v":0},{"$f":"'Data Input'!$R$3","v":0},{"$f":"'Data Input'!$R$4","v":0}]
["R",{"$f":"'Data Input'!$D$8","v":"-"},{"$f":"'Data Input'!$D$1","v":2},{"$f":"'Data Input'!$D$7","v":""},{"$f":"'Data Input'!$D$6","v":"12 - 7"},{"$f":"'Data Input'!$D$2","v":1},{"$f":"'Data Input'!$D$5","v":0},{"$f":"'Data Input'!$D$3","v":0},{"$f":"'Data Input'!$D$4","v":0}]
["AF",{"$f":"'Data Input'!$I$8","v":"x"},{"$f":"'Data Input'!$I$1","v":7},{"$f":"'Data Input'!$I$7","v":""},{"$f":"'Data Input'!$I$6","v":"3 x 2 ="},{"$f":"'Data Input'!$I$2","v":1},{"$f":"'Data Input'!$I$5","v":0},{"$f":"'Data Input'!$I$3","v":0},{"$f":"'Data Input'!$I$4","v":0}]
["AE",{"$f":"'Data Input'!$N$8","v":"x"},{"$f":"'Data Input'!$N$1","v":12},{"$f":"'Data Input'!$N$7","v":""},{"$f":"'Data Input'!$N$6","v":"8 x 5 ="},{"$f":"'Data Input'!$N$2","v":0},{"$f":"'Data Input'!$N$5","v":1},{"$f":"'Data Input'!$N$3","v":0},{"$f":"'Data Input'!$N$4","v":1}]
["D",{"$f":"'Data Input'!$H$8","v":"x"},{"$f":"'Data Input'!$H$1","v":6},{"$f":"'Data Input'!$H$7","v":""},{"$f":"'Data Input'!$H$6","v":"9 x 10 ="},{"$f":"'Data Input'!$H$2","v":1},{"$f":"'Data Input'!$H$5","v":0},{"$f":"'Data Input'!$H$3","v":0},{"$f":"'Data Input'!$H$4","v":0}]
["N",{"$f":"'Data Input'!$S$8","v":"x"},{"$f":"'Data Input'!$S$1","v":17},{"$f":"'Data Input'!$S$7","v":""},{"$f":"'Data Input'!$S$6","v":"6 x 3 ="},{"$f":"'Data Input'!$S$2","v":1},{"$f":"'Data Input'!$S$5","v":0},{"$f":"'Data Input'!$S$3","v":0},{"$f":"'Data Input'!$S$4","v":0}]
["O",{"$f":"'Data Input'!$V$8","v":"÷"},{"$f":"'Data Input'!$V$1","v":20},{"$f":"'Data Input'!$V$7","v":""},{"$f":"'Data Input'!$V$6","v":"40 ÷ 10 ="},{"$f":"'Data Input'!$V$2","v":1},{"$f":"'Data Input'!$V$5","v":0},{"$f":"'Data Input'!$V$3","v":0},{"$f":"'Data Input'!$V$4","v":0}]
["AA",{"$f":"'Data Input'!$P$8","v":"÷"},{"$f":"'Data Input'!$P$1","v":14},{"$f":"'Data Input'!$P$7","v":""},{"$f":"'Data Input'!$P$6","v":"8 ÷ 2 = "},{"$f":"'Data Input'!$P$2","v":1},{"$f":"'Data Input'!$P$5","v":0},{"$f":"'Data Input'!$P$3","v":0},{"$f":"'Data Input'!$P$4","v":0}]
["L",{"$f":"'Data Input'!$W$8","v":"÷"},{"$f":"'Data Input'!$W$1","v":21},{"$f":"'Data Input'!$W$7","v":""},{"$f":"'Data Input'!$W$6","v":"55 ÷ 5 = "},{"$f":"'Data Input'!$W$2","v":1},{"$f":"'Data Input'!$W$5","v":0},{"$f":"'Data Input'!$W$3","v":0},{"$f":"'Data Input'!$W$4","v":0}]
["Q",{"$f":"'Data Input'!$X$8","v":"F"},{"$f":"'Data Input'!$X$1","v":22},{"$f":"'Data Input'!$X$7","v":""},{"$f":"'Data Input'!$X$6","v":"1/4 of 12 = "},{"$f":"'Data Input'!$X$2","v":1},{"$f":"'Data Input'!$X$5","v":0},{"$f":"'Data Input'!$X$3","v":0},{"$f":"'Data Input'!$X$4","v":0}]
["T",{"$f":"'Data Input'!$T$8","v":"F"},{"$f":"'Data Input'!$T$1","v":18},{"$f":"'Data Input'!$T$7","v":""},{"$f":"'Data Input'!$T$6","v":"1/2 of 16 ="},{"$f":"'Data Input'!$T$2","v":1},{"$f":"'Data Input'!$T$5","v":0},{"$f":"'Data Input'!$T$3","v":0},{"$f":"'Data Input'!$T$4","v":0}]
["AL",{"$f":"'Data Input'!$Z$8","v":"F"},{"$f":"'Data Input'!$Z$1","v":24},{"$f":"'Data Input'!$Z$7","v":""},{"$f":"'Data Input'!$Z$6","v":"1/3 of 30 ="},{"$f":"'Data Input'!$Z$2","v":0},{"$f":"'Data Input'!$Z$5","v":1},{"$f":"'Data Input'!$Z$3","v":1},{"$f":"'Data Input'!$Z$4","v":0}]
["U",{"$f":"'Data Input'!$AA$8","v":"F"},{"$f":"'Data Input'!$AA$1","v":25},{"$f":"'Data Input'!$AA$7","v":""},{"$f":"'Data Input'!$AA$6","v":"3/4 of 20 ="},{"$f":"'Data Input'!$AA$2","v":1},{"$f":"'Data Input'!$AA$5","v":0},{"$f":"'Data Input'!$AA$3","v":0},{"$f":"'Data Input'!$AA$4","v":0}]
[]
["V",{"$f":"'Data Input'!$J$8","v":"+"},{"$f":"'Data Input'!$J$1","v":8},{"$f":"'Data Input'!$J$7","v":"I"},{"$f":"'Data Input'!$J$6","v":"50 + __ = 80"},{"$f":"'Data Input'!$J$2","v":0},{"$f":"'Data Input'!$J$5","v":1},{"$f":"'Data Input'!$J$3","v":1},{"$f":"'Data Input'!$J$4","v":0}]
["E",{"$f":"'Data Input'!$Q$8","v":"+"},{"$f":"'Data Input'!$Q$1","v":15},{"$f":"'Data Input'!$Q$7","v":"I"},{"$f":"'Data Input'!$Q$6","v":"28 + __ = 35"},{"$f":"'Data Input'!$Q$2","v":1},{"$f":"'Data Input'!$Q$5","v":0},{"$f":"'Data Input'!$Q$3","v":0},{"$f":"'Data Input'!$Q$4","v":0}]
["P",{"$f":"'Data Input'!$K$8","v":"-"},{"$f":"'Data Input'!$K$1","v":9},{"$f":"'Data Input'!$K$7","v":"I"},{"$f":"'Data Input'!$K$6","v":"56 - __ = 51"},{"$f":"'Data Input'!$K$2","v":1},{"$f":"'Data Input'!$K$5","v":0},{"$f":"'Data Input'!$K$3","v":0},{"$f":"'Data Input'!$K$4","v":0}]
["S",{"$f":"'Data Input'!$Y$8","v":"-"},{"$f":"'Data Input'!$Y$1","v":23},{"$f":"'Data Input'!$Y$7","v":"I"},{"$f":"'Data Input'!$Y$6","v":"71 - 14 = "},{"$f":"'Data Input'!$Y$2","v":1},{"$f":"'Data Input'!$Y$5","v":0},{"$f":"'Data Input'!$Y$3","v":0},{"$f":"'Data Input'!$Y$4","v":0}]
["G",{"$f":"'Data Input'!$E$8","v":"-"},{"$f":"'Data Input'!$E$1","v":3},{"$f":"'Data Input'!$E$7","v":"I"},{"$f":"'Data Input'!$E$6","v":"10 - __ = 2"},{"$f":"'Data Input'!$E$2","v":1},{"$f":"'Data Input'!$E$5","v":0},{"$f":"'Data Input'!$E$3","v":0},{"$f":"'Data Input'!$E$4","v":0}]
[]
["I",{"$f":"'Data Input'!$G$8","v":"+"},{"$f":"'Data Input'!$G$1","v":5},{"$f":"'Data Input'!$G$7","v":"M"},{"$f":"'Data Input'!$G$6","v":"4 + 5 + 6"},{"$f":"'Data Input'!$G$2","v":1},{"$f":"'Data Input'!$G$5","v":0},{"$f":"'Data Input'!$G$3","v":0},{"$f":"'Data Input'!$G$4","v":0}]
["H",{"$f":"'Data Input'!$L$8","v":"+"},{"$f":"'Data Input'!$L$1","v":10},{"$f":"'Data Input'!$L$7","v":"M"},{"$f":"'Data Input'!$L$6","v":"10 + 40 + 20 ="},{"$f":"'Data Input'!$L$2","v":1},{"$f":"'Data Input'!$L$5","v":0},{"$f":"'Data Input'!$L$3","v":0},{"$f":"'Data Input'!$L$4","v":0}]
["F",{"$f":"'Data Input'!$M$8","v":"-"},{"$f":"'Data Input'!$M$1","v":11},{"$f":"'Data Input'!$M$7","v":"M"},{"$f":"'Data Input'!$M$6","v":"63 - 10 - 10 ="},{"$f":"'Data Input'!$M$2","v":1},{"$f":"'Data Input'!$M$5","v":0},{"$f":"'Data Input'!$M$3","v":0},{"$f":"'Data Input'!$M$4","v":0}]
[]
[]
[]
[null,null,null,"Sorted by Correct",null,null,null,null,null,null,null,null,null,null,"Sorted by Correct"]
[null,null,null,"Strand","Question Number","Sub Category","Short Q","Correct","Incorrect or Unanswered","Incorrect","Unanswered",null,"Rank","rank maths","Strand","Question Number","Sub Category","Short Q","Correct","Incorrect or unanswered","Incorrect","Unanswered"]
[null,{"$f":"RANK(C105,$C$105:$C$139)","v":1},{"$f":" H105 - ROW()*0.000000001","v":0.99999989499999997},{"$f":"'Data Input'!$C$8","v":"+"},{"$f":"'Data Input'!$C$1","v":1},{"$f":"'Data Input'!$C$7","v":""},{"$f":"'Data Input'!$C$6","v":"8 + 6"},{"$f":"'Data Input'!$C$2","v":1},{"$f":"'Data Input'!$C$5","v":0},{"$f":"'Data Input'!$C$3","v":0},{"$f":"'Data Input'!$C$4","v":0},null,{"$f":"VLOOKUP(ROW()-ROW(M$104),$B$105:$J$139,1,FALSE)","v":1},{"$f":"VLOOKUP(ROW()-ROW(M$104),$B$105:$J$139,2,FALSE)","v":0.99999989499999997},{"$f":"VLOOKUP(ROW()-ROW(M$104),$B$105:$J$139,3,FALSE)","v":"+"},{"$f":"VLOOKUP(ROW()-ROW(M$104),$B$105:$J$139,4,FALSE)","v":1},{"$f":"VLOOKUP(ROW()-ROW(M$104),$B$105:$J$139,5,FALSE)","v":""},{"$f":"VLOOKUP(ROW()-ROW(M$104),$B$105:$J$139,6,FALSE)","v":"8 + 6"},{"$f":"VLOOKUP(ROW()-ROW(M$104),$B$105:$J$139,7,FALSE)","v":1},{"$f":"VLOOKUP(ROW()-ROW(M$104),$B$105:$J$139,8,FALSE)","v":0},{"$f":"VLOOKUP(ROW()-ROW(M$104),$B$105:$K$139,9,FALSE)","v":0},{"$f":"VLOOKUP(ROW()-ROW(M$104),$B$105:$K$139,10,FALSE)","v":0}]
[null,2,{"$f":" H106 - ROW()*0.000000001","v":0.999999894},{"$f":"'Data Input'!$D$8","v":"-"},{"$f":"'Data Input'!$D$1","v":2},{"$f":"'Data Input'!$D$7","v":""},{"$f":"'Data Input'!$D$6","v":"12 - 7"},{"$f":"'Data Input'!$D$2","v":1},{"$f":"'Data Input'!$D$5","v":0},{"$f":"'Data Input'!$D$3","v":0},{"$f":"'Data Input'!$D$4","v":0},null,2,0.999999894,"-",2,"","12 - 7",1,0,0,0]
[null,3,0.99999989300000003,{"$f":"'Data Input'!$E$8","v":"-"},{"$f":"'Data Input'!$E$1","v":3},{"$f":"'Data Input'!$E$7","v":"I"},{"$f":"'Data Input'!$E$6","v":"10 - __ = 2"},{"$f":"'Data Input'!$E$2","v":1},{"$f":"'Data Input'!$E$5","v":0},{"$f":"'Data Input'!$E$3","v":0},{"$f":"'Data Input'!$E$4","v":0},null,3,0.99999989300000003,"-",3,"I","10 - __ = 2",1,0,0,0]
[null,4,0.99999989199999995,{"$f":"'Data Input'!$F$8","v":"+"},{"$f":"'Data Input'!$F$1","v":4},{"$f":"'Data Input'!$F$7","v":""},{"$f":"'Data Input'!$F$6","v":"52 + 7"},{"$f":"'Data Input'!$F$2","v":1},{"$f":"'Data Input'!$F$5","v":0},{"$f":"'Data Input'!$F$3","v":0},{"$f":"'Data Input'!$F$4","v":0},null,4,0.99999989199999995,"+",4,"","52 + 7",1,0,0,0]
[null,5,0.99999989099999997,{"$f":"'Data Input'!$G$8","v":"+"},{"$f":"'Data Input'!$G$1","v":5},{"$f":"'Data Input'!$G$7","v":"M"},{"$f":"'Data Input'!$G$6","v":"4 + 5 + 6"},{"$f":"'Data Input'!$G$2","v":1},{"$f":"'Data Input'!$G$5","v":0},{"$f":"'Data Input'!$G$3","v":0},{"$f":"'Data Input'!$G$4","v":0},null,5,0.99999989099999997,"+",5,"M","4 + 5 + 6",1,0,0,0]
[null,6,0.99999989,{"$f":"'Data Input'!$H$8","v":"x"},{"$f":"'Data Input'!$H$1","v":6},{"$f":"'Data Input'!$H$7","v":""},{"$f":"'Data Input'!$H$6","v":"9 x 10 ="},{"$f":"'Data Input'!$H$2","v":1},{"$f":"'Data Input'!$H$5","v":0},{"$f":"'Data Input'!$H$3","v":0},{"$f":"'Data Input'!$H$4","v":0},null,6,0.99999989,"x",6,"","9 x 10 =",1,0,0,0]
[null,7,0.99999988900000003,{"$f":"'Data Input'!$I$8","v":"x"},{"$f":"'Data Input'!$I$1","v":7},{"$f":"'Data Input'!$I$7","v":""},{"$f":"'Data Input'!$I$6","v":"3 x 2 ="},{"$f":"'Data Input'!$I$2","v":1},{"$f":"'Data Input'!$I$5","v":0},{"$f":"'Data Input'!$I$3","v":0},{"$f":"'Data Input'!$I$4","v":0},null,7,0.99999988900000003,"x",7,"","3 x 2 =",1,0,0,0]
[null,23,-1.1200000000000001E-7,{"$f":"'Data Input'!$J$8","v":"+"},{"$f":"'Data Input'!$J$1","v":8},{"$f":"'Data Input'!$J$7","v":"I"},{"$f":"'Data Input'!$J$6","v":"50 + __ = 80"},{"$f":"'Data Input'!$J$2","v":0},{"$f":"'Data Input'!$J$5","v":1},{"$f":"'Data Input'!$J$3","v":1},{"$f":"'Data Input'!$J$4","v":0},null,8,0.99999988699999998,"-",9,"I","56 - __ = 51",1,0,0,0]
[null,8,0.99999988699999998,{"$f":"'Data Input'!$K$8","v":"-"},{"$f":"'Data Input'!$K$1","v":9},{"$f":"'Data Input'!$K$7","v":"I"},{"$f":"'Data Input'!$K$6","v":"56 - __ = 51"},{"$f":"'Data Input'!$K$2","v":1},{"$f":"'Data Input'!$K$5","v":0},{"$f":"'Data Input'!$K$3","v":0},{"$f":"'Data Input'!$K$4","v":0},null,9,0.999999886,"+",10,"M","10 + 40 + 20 =",1,0,0,0]
[null,9,0.999999886,{"$f":"'Data Input'!$L$8","v":"+"},{"$f":"'Data Input'!$L$1","v":10},{"$f":"'Data Input'!$L$7","v":"M"},{"$f":"'Data Input'!$L$6","v":"10 + 40 + 20 ="},{"$f":"'Data Input'!$L$2","v":1},{"$f":"'Data Input'!$L$5","v":0},{"$f":"'Data Input'!$L$3","v":0},{"$f":"'Data Input'!$L$4","v":0},null,10,0.99999988500000003,"-",11,"M","63 - 10 - 10 =",1,0,0,0]
[null,10,0.99999988500000003,{"$f":"'Data Input'!$M$8","v":"-"},{"$f":"'Data Input'!$M$1","v":11},{"$f":"'Data Input'!$M$7","v":"M"},{"$f":"'Data Input'!$M$6","v":"63 - 10 - 10 ="},{"$f":"'Data Input'!$M$2","v":1},{"$f":"'Data Input'!$M$5","v":0},{"$f":"'Data Input'!$M$3","v":0},{"$f":"'Data Input'!$M$4","v":0},null,11,0.99999988299999998,"+",13,"","21 + 40 =",1,0,0,0]
[null,24,-1.1600000000000001E-7,{"$f":"'Data Input'!$N$8","v":"x"},{"$f":"'Data Input'!$N$1","v":12},{"$f":"'Data Input'!$N$7","v":""},{"$f":"'Data Input'!$N$6","v":"8 x 5 ="},{"$f":"'Data Input'!$N$2","v":0},{"$f":"'Data Input'!$N$5","v":1},{"$f":"'Data Input'!$N$3","v":0},{"$f":"'Data Input'!$N$4","v":1},null,12,0.99999988200000001,"÷",14,"","8 ÷ 2 = ",1,0,0,0]
[null,11,0.99999988299999998,{"$f":"'Data Input'!$O$8","v":"+"},{"$f":"'Data Input'!$O$1","v":13},{"$f":"'Data Input'!$O$7","v":""},{"$f":"'Data Input'!$O$6","v":"21 + 40 ="},{"$f":"'Data Input'!$O$2","v":1},{"$f":"'Data Input'!$O$5","v":0},{"$f":"'Data Input'!$O$3","v":0},{"$f":"'Data Input'!$O$4","v":0},null,13,0.99999988100000003,"+",15,"I","28 + __ = 35",1,0,0,0]
[null,12,0.99999988200000001,{"$f":"'Data Input'!$P$8","v":"÷"},{"$f":"'Data Input'!$P$1","v":14},{"$f":"'Data Input'!$P$7","v":""},{"$f":"'Data Input'!$P$6","v":"8 ÷ 2 = "},{"$f":"'Data Input'!$P$2","v":1},{"$f":"'Data Input'!$P$5","v":0},{"$f":"'Data Input'!$P$3","v":0},{"$f":"'Data Input'!$P$4","v":0},null,14,0.99999987999999995,"+",16,"","69 + 11 =",1,0,0,0]
[null,13,0.99999988100000003,{"$f":"'Data Input'!$Q$8","v":"+"},{"$f":"'Data Input'!$Q$1","v":15},{"$f":"'Data Input'!$Q$7","v":"I"},{"$f":"'Data Input'!$Q$6","v":"28 + __ = 35"},{"$f":"'Data Input'!$Q$2","v":1},{"$f":"'Data Input'!$Q$5","v":0},{"$f":"'Data Input'!$Q$3","v":0},{"$f":"'Data Input'!$Q$4","v":0},null,15,0.99999987899999998,"x",17,"","6 x 3 =",1,0,0,0]
[null,14,0.99999987999999995,{"$f":"'Data Input'!$R$8","v":"+"},{"$f":"'Data Input'!$R$1","v":16},{"$f":"'Data Input'!$R$7","v":""},{"$f":"'Data Input'!$R$6","v":"69 + 11 ="},{"$f":"'Data Input'!$R$2","v":1},{"$f":"'Data Input'!$R$5","v":0},{"$f":"'Data Input'!$R$3","v":0},{"$f":"'Data Input'!$R$4","v":0},null,16,0.99999987800000001,"F",18,"","1/2 of 16 =",1,0,0,0]
[null,15,0.99999987899999998,{"$f":"'Data Input'!$S$8","v":"x"},{"$f":"'Data Input'!$S$1","v":17},{"$f":"'Data Input'!$S$7","v":""},{"$f":"'Data Input'!$S$6","v":"6 x 3 ="},{"$f":"'Data Input'!$S$2","v":1},{"$f":"'Data Input'!$S$5","v":0},{"$f":"'Data Input'!$S$3","v":0},{"$f":"'Data Input'!$S$4","v":0},null,17,0.99999987700000004,"+",19,"","55 + 17 =",1,0,0,0]
[null,16,0.99999987800000001,{"$f":"'Data Input'!$T$8","v":"F"},{"$f":"'Data Input'!$T$1","v":18},{"$f":"'Data Input'!$T$7","v":""},{"$f":"'Data Input'!$T$6","v":"1/2 of 16 ="},{"$f":"'Data Input'!$T$2","v":1},{"$f":"'Data Input'!$T$5","v":0},{"$f":"'Data Input'!$T$3","v":0},{"$f":"'Data Input'!$T$4","v":0},null,18,0.99999987599999995,"÷",20,"","40 ÷ 10 =",1,0,0,0]
[null,17,0.99999987700000004,{"$f":"'Data Input'!$U$8","v":"+"},{"$f":"'Data Input'!$U$1","v":19},{"$f":"'Data Input'!$U$7","v":""},{"$f":"'Data Input'!$U$6","v":"55 + 17 ="},{"$f":"'Data Input'!$U$2","v":1},{"$f":"'Data Input'!$U$5","v":0},{"$f":"'Data Input'!$U$3","v":0},{"$f":"'Data Input'!$U$4","v":0},null,19,0.99999987499999998,"÷",21,"","55 ÷ 5 = ",1,0,0,0]
[null,18,0.99999987599999995,{"$f":"'Data Input'!$V$8","v":"÷"},{"$f":"'Data Input'!$V$1","v":20},{"$f":"'Data Input'!$V$7","v":""},{"$f":"'Data Input'!$V$6","v":"40 ÷ 10 ="},{"$f":"'Data Input'!$V$2","v":1},{"$f":"'Data Input'!$V$5","v":0},{"$f":"'Data Input'!$V$3","v":0},{"$f":"'Data Input'!$V$4","v":0},null,20,0.99999987400000001,"F",22,"","1/4 of 12 = ",1,0,0,0]
[null,19,{"$f":" H125 - ROW()*0.000000001","v":0.99999987499999998},{"$f":"'Data Input'!$W$8","v":"÷"},{"$f":"'Data Input'!$W$1","v":21},{"$f":"'Data Input'!$W$7","v":""},{"$f":"'Data Input'!$W$6","v":"55 ÷ 5 = "},{"$f":"'Data Input'!$W$2","v":1},{"$f":"'Data Input'!$W$5","v":0},{"$f":"'Data Input'!$W$3","v":0},{"$f":"'Data Input'!$W$4","v":0},null,21,0.99999987300000004,"-",23,"I","71 - 14 = ",1,0,0,0]
[null,20,{"$f":" H126 - ROW()*0.000000001","v":0.99999987400000001},{"$f":"'Data Input'!$X$8","v":"F"},{"$f":"'Data Input'!$X$1","v":22},{"$f":"'Data Input'!$X$7","v":""},{"$f":"'Data Input'!$X$6","v":"1/4 of 12 = "},{"$f":"'Data Input'!$X$2","v":1},{"$f":"'Data Input'!$X$5","v":0},{"$f":"'Data Input'!$X$3","v":0},{"$f":"'Data Input'!$X$4","v":0},null,22,0.99999987099999998,"F",25,"","3/4 of 20 =",1,0,0,0]
[null,21,{"$f":" H127 - ROW()*0.000000001","v":0.99999987300000004},{"$f":"'Data Input'!$Y$8","v":"-"},{"$f":"'Data Input'!$Y$1","v":23},{"$f":"'Data Input'!$Y$7","v":"I"},{"$f":"'Data Input'!$Y$6","v":"71 - 14 = "},{"$f":"'Data Input'!$Y$2","v":1},{"$f":"'Data Input'!$Y$5","v":0},{"$f":"'Data Input'!$Y$3","v":0},{"$f":"'Data Input'!$Y$4","v":0},null,23,-1.1200000000000001E-7,"+",8,"I","50 + __ = 80",0,1,1,0]
[null,25,{"$f":" H128 - ROW()*0.000000001","v":-1.2800000000000001E-7},{"$f":"'Data Input'!$Z$8","v":"F"},{"$f":"'Data Input'!$Z$1","v":24},{"$f":"'Data Input'!$Z$7","v":""},{"$f":"'Data Input'!$Z$6","v":"1/3 of 30 ="},{"$f":"'Data Input'!$Z$2","v":0},{"$f":"'Data Input'!$Z$5","v":1},{"$f":"'Data Input'!$Z$3","v":1},{"$f":"'Data Input'!$Z$4","v":0},null,24,-1.1600000000000001E-7,"x",12,"","8 x 5 =",0,1,0,1]
[null,22,{"$f":" H129 - ROW()*0.000000001","v":0.99999987099999998},{"$f":"'Data Input'!$AA$8","v":"F"},{"$f":"'Data Input'!$AA$1","v":25},{"$f":"'Data Input'!$AA$7","v":""},{"$f":"'Data Input'!$AA$6","v":"3/4 of 20 ="},{"$f":"'Data Input'!$AA$2","v":1},{"$f":"'Data Input'!$AA$5","v":0},{"$f":"'Data Input'!$AA$3","v":0},{"$f":"'Data Input'!$AA$4","v":0},null,25,-1.2800000000000001E-7,"F",24,"","1/3 of 30 =",0,1,1,0]

{"sheet":"Pupil Summary","index":3,"n_rows":273,"n_cols":16,"rows_kept":273,"cut":false,"hidden":false,"merged":[[1,14,1,15],[1,1,1,5],[1,6,1,7],[1,8,1,9],[1,10,1,11],[1,12,1,13]]}
[null,null,"Green: <35%, Amber: <50%, Red: >50%",null,"Green %>",0.64,"Amber %>",0.37,"Red %<",{"$f":"H1","v":0.37},null,null,null,null,"Pupil Summary"]
[{"$f":"\"Total Pupils: \" & COUNTA('Data Input'!A10:A278)","v":"Total Pupils: 1"},"Overall",null,null,null,null,"+",null,"-",null,"x",null,"÷",null,"F"]
["Name:","Unanswered","Incorrect","Incorrecr or Unanswered",{"$f":"\"Total Score \"&COUNTA('Data Input'!C8:AA8)","v":"Total Score 25"},"Percent",{"$f":"\"Score /\" & COUNTIF('Data Input'!$C$8:$AA$8,\"+\")","v":"Score /9"},"Percent",{"$f":"\"Score /\" & COUNTIF('Data Input'!$C$8:$AA$8,\"-\")","v":"Score /5"},"Percent",{"$f":"\"Score /\" & COUNTIF('Data Input'!$C$8:$AA$8,\"x\")","v":"Score /4"},"Percent ",{"$f":"\"Score /\" & COUNTIF('Data Input'!$C$8:$AA$8,\"÷\")","v":"Score /3"},"Percent ",{"$f":"\"Score /\" & COUNTIF('Data Input'!$C$8:$AA$8,\"F\")","v":"Score /4"},"Percent "]
[]
[{"$f":"IF('Data Input'!A10=0,\"\",'Data Input'!A10)","v":"Sample - please delete!"},{"$f":"IF(ISBLANK('Data Input'!A10),\"\",COUNTIF('Data Input'!C10:AA10,\"\"))","v":1},{"$f":"IF(ISBLANK('Data Input'!A10),\"\",COUNTIF('Data Input'!C10:AA10,\"0\"))","v":2},{"$f":"IF(ISBLANK('Data Input'!A10),\"\",SUM(B5,C5))","v":3},{"$f":"IF(ISBLANK('Data Input'!A10),\"\",SUM('Data Input'!C10:AA10))","v":22},{"$f":"IF(E5=\"\",\"\",E5/(COUNTA('Data Input'!$C$8:$AA$8)))","v":0.88},{"$f":"IF(ISBLANK('Data Input'!A10),\"\",SUM('Data Input'!C10,'Data Input'!F10,'Data Input'!G10,'Data Input'!J10,'Data Input'!L10,'Data Input'!O10,'Data Input'!Q10,'Data Input'!R10,'Data Input'!U10))","v":8},{"$f":"IF(G5=\"\",\"\",G5/COUNTIF('Data Input'!$C$8:$AA$8,\"+\"))","v":0.88888888888888884},{"$f":"IF(ISBLANK('Data Input'!A10),\"\",SUM('Data Input'!D10,'Data Input'!E10,'Data Input'!K10,'Data Input'!M10,'Data Input'!Y10))","v":5},{"$f":"IF(I5=\"\",\"\",I5/COUNTIF('Data Input'!$C$8:$AA$8,\"-\"))","v":1},{"$f":"IF(ISBLANK('Data Input'!A10),\"\",SUM('Data Input'!H10,'Data Input'!I10,'Data Input'!N10,'Data Input'!S10))","v":3},{"$f":"IF(K5=\"\",\"\",K5/COUNTIF('Data Input'!$C$8:$AA$8,\"x\"))","v":0.75},{"$f":"IF(ISBLANK('Data Input'!A10),\"\",SUM('Data Input'!P10,'Data Input'!V10,'Data Input'!W10))","v":3},{"$f":"IF(M5=\"\",\"\",M5/COUNTIF('Data Input'!$C$8:$AA$8,\"÷\"))","v":1},{"$f":"IF(ISBLANK('Data Input'!A10),\"\",SUM('Data Input'!T10,'Data Input'!X10,'Data Input'!Z10,'Data Input'!AA10))","v":3},{"$f":"IF(O5=\"\",\"\",O5/COUNTIF('Data Input'!$C$8:$AA$8,\"F\"))","v":0.75}]
[{"$f":"IF('Data Input'!A11=0,\"\",'Data Input'!A11)","v":""},{"$f":"IF(ISBLANK('Data Input'!A11),\"\",COUNTIF('Data Input'!C11:AA11,\"\"))","v":""},{"$f":"IF(ISBLANK('Data Input'!A11),\"\",COUNTIF('Data Input'!C11:AA11,\"0\"))","v":""},{"$f":"IF(ISBLANK('Data Input'!A11),\"\",SUM(B6,C6))","v":""},{"$f":"IF(ISBLANK('Data Input'!A11),\"\",SUM('Data Input'!C11:AA11))","v":""},{"$f":"IF(E6=\"\",\"\",E6/(COUNTA('Data Input'!$C$8:$AA$8)))","v":""},{"$f":"IF(ISBLANK('Data Input'!A11),\"\",SUM('Data Input'!C11,'Data Input'!F11,'Data Input'!G11,'Data Input'!J11,'Data Input'!L11,'Data Input'!O11,'Data Input'!Q11,'Data Input'!R11,'Data Input'!U11))","v":""},{"$f":"IF(G6=\"\",\"\",G6/COUNTIF('Data Input'!$C$8:$AA$8,\"+\"))","v":""},{"$f":"IF(ISBLANK('Data Input'!A11),\"\",SUM('Data Input'!D11,'Data Input'!E11,'Data Input'!K11,'Data Input'!M11,'Data Input'!Y11))","v":""},{"$f":"IF(I6=\"\",\"\",I6/COUNTIF('Data Input'!$C$8:$AA$8,\"-\"))","v":""},{"$f":"IF(ISBLANK('Data Input'!A11),\"\",SUM('Data Input'!H11,'Data Input'!I11,'Data Input'!N11,'Data Input'!S11))","v":""},{"$f":"IF(K6=\"\",\"\",K6/COUNTIF('Data Input'!$C$8:$AA$8,\"x\"))","v":""},{"$f":"IF(ISBLANK('Data Input'!A11),\"\",SUM('Data Input'!P11,'Data Input'!V11,'Data Input'!W11))","v":""},{"$f":"IF(M6=\"\",\"\",M6/COUNTIF('Data Input'!$C$8:$AA$8,\"÷\"))","v":""},{"$f":"IF(ISBLANK('Data Input'!A11),\"\",SUM('Data Input'!T11,'Data Input'!X11,'Data Input'!Z11,'Data Input'!AA11))","v":""},{"$f":"IF(O6=\"\",\"\",O6/COUNTIF('Data Input'!$C$8:$AA$8,\"F\"))","v":""}]
[{"$f":"IF('Data Input'!A12=0,\"\",'Data Input'!A12)","v":""},{"$f":"IF(ISBLANK('Data Input'!A12),\"\",COUNTIF('Data Input'!C12:AA12,\"\"))","v":""},{"$f":"IF(ISBLANK('Data Input'!A12),\"\",COUNTIF('Data Input'!C12:AA12,\"0\"))","v":""},{"$f":"IF(ISBLANK('Data Input'!A12),\"\",SUM(B7,C7))","v":""},{"$f":"IF(ISBLANK('Data Input'!A12),\"\",SUM('Data Input'!C12:AA12))","v":""},{"$f":"IF(E7=\"\",\"\",E7/(COUNTA('Data Input'!$C$8:$AA$8)))","v":""},{"$f":"IF(ISBLANK('Data Input'!A12),\"\",SUM('Data Input'!C12,'Data Input'!F12,'Data Input'!G12,'Data Input'!J12,'Data Input'!L12,'Data Input'!O12,'Data Input'!Q12,'Data Input'!R12,'Data Input'!U12))","v":""},{"$f":"IF(G7=\"\",\"\",G7/COUNTIF('Data Input'!$C$8:$AA$8,\"+\"))","v":""},{"$f":"IF(ISBLANK('Data Input'!A12),\"\",SUM('Data Input'!D12,'Data Input'!E12,'Data Input'!K12,'Data Input'!M12,'Data Input'!Y12))","v":""},{"$f":"IF(I7=\"\",\"\",I7/COUNTIF('Data Input'!$C$8:$AA$8,\"-\"))","v":""},{"$f":"IF(ISBLANK('Data Input'!A12),\"\",SUM('Data Input'!H12,'Data Input'!I12,'Data Input'!N12,'Data Input'!S12))","v":""},{"$f":"IF(K7=\"\",\"\",K7/COUNTIF('Data Input'!$C$8:$AA$8,\"x\"))","v":""},{"$f":"IF(ISBLANK('Data Input'!A12),\"\",SUM('Data Input'!P12,'Data Input'!V12,'Data Input'!W12))","v":""},{"$f":"IF(M7=\"\",\"\",M7/COUNTIF('Data Input'!$C$8:$AA$8,\"÷\"))","v":""},{"$f":"IF(ISBLANK('Data Input'!A12),\"\",SUM('Data Input'!T12,'Data Input'!X12,'Data Input'!Z12,'Data Input'!AA12))","v":""},{"$f":"IF(O7=\"\",\"\",O7/COUNTIF('Data Input'!$C$8:$AA$8,\"F\"))","v":""}]
[{"$f":"IF('Data Input'!A13=0,\"\",'Data Input'!A13)","v":""},{"$f":"IF(ISBLANK('Data Input'!A13),\"\",COUNTIF('Data Input'!C13:AA13,\"\"))","v":""},{"$f":"IF(ISBLANK('Data Input'!A13),\"\",COUNTIF('Data Input'!C13:AA13,\"0\"))","v":""},{"$f":"IF(ISBLANK('Data Input'!A13),\"\",SUM(B8,C8))","v":""},{"$f":"IF(ISBLANK('Data Input'!A13),\"\",SUM('Data Input'!C13:AA13))","v":""},{"$f":"IF(E8=\"\",\"\",E8/(COUNTA('Data Input'!$C$8:$AA$8)))","v":""},{"$f":"IF(ISBLANK('Data Input'!A13),\"\",SUM('Data Input'!C13,'Data Input'!F13,'Data Input'!G13,'Data Input'!J13,'Data Input'!L13,'Data Input'!O13,'Data Input'!Q13,'Data Input'!R13,'Data Input'!U13))","v":""},{"$f":"IF(G8=\"\",\"\",G8/COUNTIF('Data Input'!$C$8:$AA$8,\"+\"))","v":""},{"$f":"IF(ISBLANK('Data Input'!A13),\"\",SUM('Data Input'!D13,'Data Input'!E13,'Data Input'!K13,'Data Input'!M13,'Data Input'!Y13))","v":""},{"$f":"IF(I8=\"\",\"\",I8/COUNTIF('Data Input'!$C$8:$AA$8,\"-\"))","v":""},{"$f":"IF(ISBLANK('Data Input'!A13),\"\",SUM('Data Input'!H13,'Data Input'!I13,'Data Input'!N13,'Data Input'!S13))","v":""},{"$f":"IF(K8=\"\",\"\",K8/COUNTIF('Data Input'!$C$8:$AA$8,\"x\"))","v":""},{"$f":"IF(ISBLANK('Data Input'!A13),\"\",SUM('Data Input'!P13,'Data Input'!V13,'Data Input'!W13))","v":""},{"$f":"IF(M8=\"\",\"\",M8/COUNTIF('Data Input'!$C$8:$AA$8,\"÷\"))","v":""},{"$f":"IF(ISBLANK('Data Input'!A13),\"\",SUM('Data Input'!T13,'Data Input'!X13,'Data Input'!Z13,'Data Input'!AA13))","v":""},{"$f":"IF(O8=\"\",\"\",O8/COUNTIF('Data Input'!$C$8:$AA$8,\"F\"))","v":""}]
[{"$f":"IF('Data Input'!A14=0,\"\",'Data Input'!A14)","v":""},{"$f":"IF(ISBLANK('Data Input'!A14),\"\",COUNTIF('Data Input'!C14:AA14,\"\"))","v":""},{"$f":"IF(ISBLANK('Data Input'!A14),\"\",COUNTIF('Data Input'!C14:AA14,\"0\"))","v":""},{"$f":"IF(ISBLANK('Data Input'!A14),\"\",SUM(B9,C9))","v":""},{"$f":"IF(ISBLANK('Data Input'!A14),\"\",SUM('Data Input'!C14:AA14))","v":""},{"$f":"IF(E9=\"\",\"\",E9/(COUNTA('Data Input'!$C$8:$AA$8)))","v":""},{"$f":"IF(ISBLANK('Data Input'!A14),\"\",SUM('Data Input'!C14,'Data Input'!F14,'Data Input'!G14,'Data Input'!J14,'Data Input'!L14,'Data Input'!O14,'Data Input'!Q14,'Data Input'!R14,'Data Input'!U14))","v":""},{"$f":"IF(G9=\"\",\"\",G9/COUNTIF('Data Input'!$C$8:$AA$8,\"+\"))","v":""},{"$f":"IF(ISBLANK('Data Input'!A14),\"\",SUM('Data Input'!D14,'Data Input'!E14,'Data Input'!K14,'Data Input'!M14,'Data Input'!Y14))","v":""},{"$f":"IF(I9=\"\",\"\",I9/COUNTIF('Data Input'!$C$8:$AA$8,\"-\"))","v":""},{"$f":"IF(ISBLANK('Data Input'!A14),\"\",SUM('Data Input'!H14,'Data Input'!I14,'Data Input'!N14,'Data Input'!S14))","v":""},{"$f":"IF(K9=\"\",\"\",K9/COUNTIF('Data Input'!$C$8:$AA$8,\"x\"))","v":""},{"$f":"IF(ISBLANK('Data Input'!A14),\"\",SUM('Data Input'!P14,'Data Input'!V14,'Data Input'!W14))","v":""},{"$f":"IF(M9=\"\",\"\",M9/COUNTIF('Data Input'!$C$8:$AA$8,\"÷\"))","v":""},{"$f":"IF(ISBLANK('Data Input'!A14),\"\",SUM('Data Input'!T14,'Data Input'!X14,'Data Input'!Z14,'Data Input'!AA14))","v":""},{"$f":"IF(O9=\"\",\"\",O9/COUNTIF('Data Input'!$C$8:$AA$8,\"F\"))","v":""}]
[{"$f":"IF('Data Input'!A15=0,\"\",'Data Input'!A15)","v":""},{"$f":"IF(ISBLANK('Data Input'!A15),\"\",COUNTIF('Data Input'!C15:AA15,\"\"))","v":""},{"$f":"IF(ISBLANK('Data Input'!A15),\"\",COUNTIF('Data Input'!C15:AA15,\"0\"))","v":""},{"$f":"IF(ISBLANK('Data Input'!A15),\"\",SUM(B10,C10))","v":""},{"$f":"IF(ISBLANK('Data Input'!A15),\"\",SUM('Data Input'!C15:AA15))","v":""},{"$f":"IF(E10=\"\",\"\",E10/(COUNTA('Data Input'!$C$8:$AA$8)))","v":""},{"$f":"IF(ISBLANK('Data Input'!A15),\"\",SUM('Data Input'!C15,'Data Input'!F15,'Data Input'!G15,'Data Input'!J15,'Data Input'!L15,'Data Input'!O15,'Data Input'!Q15,'Data Input'!R15,'Data Input'!U15))","v":""},{"$f":"IF(G10=\"\",\"\",G10/COUNTIF('Data Input'!$C$8:$AA$8,\"+\"))","v":""},{"$f":"IF(ISBLANK('Data Input'!A15),\"\",SUM('Data Input'!D15,'Data Input'!E15,'Data Input'!K15,'Data Input'!M15,'Data Input'!Y15))","v":""},{"$f":"IF(I10=\"\",\"\",I10/COUNTIF('Data Input'!$C$8:$AA$8,\"-\"))","v":""},{"$f":"IF(ISBLANK('Data Input'!A15),\"\",SUM('Data Input'!H15,'Data Input'!I15,'Data Input'!N15,'Data Input'!S15))","v":""},{"$f":"IF(K10=\"\",\"\",K10/COUNTIF('Data Input'!$C$8:$AA$8,\"x\"))","v":""},{"$f":"IF(ISBLANK('Data Input'!A15),\"\",SUM('Data Input'!P15,'Data Input'!V15,'Data Input'!W15))","v":""},{"$f":"IF(M10=\"\",\"\",M10/COUNTIF('Data Input'!$C$8:$AA$8,\"÷\"))","v":""},{"$f":"IF(ISBLANK('Data Input'!A15),\"\",SUM('Data Input'!T15,'Data Input'!X15,'Data Input'!Z15,'Data Input'!AA15))","v":""},{"$f":"IF(O10=\"\",\"\",O10/COUNTIF('Data Input'!$C$8:$AA$8,\"F\"))","v":""}]
[{"$f":"IF('Data Input'!A16=0,\"\",'Data Input'!A16)","v":""},{"$f":"IF(ISBLANK('Data Input'!A16),\"\",COUNTIF('Data Input'!C16:AA16,\"\"))","v":""},{"$f":"IF(ISBLANK('Data Input'!A16),\"\",COUNTIF('Data Input'!C16:AA16,\"0\"))","v":""},{"$f":"IF(ISBLANK('Data Input'!A16),\"\",SUM(B11,C11))","v":""},{"$f":"IF(ISBLANK('Data Input'!A16),\"\",SUM('Data Input'!C16:AA16))","v":""},{"$f":"IF(E11=\"\",\"\",E11/(COUNTA('Data Input'!$C$8:$AA$8)))","v":""},{"$f":"IF(ISBLANK('Data Input'!A16),\"\",SUM('Data Input'!C16,'Data Input'!F16,'Data Input'!G16,'Data Input'!J16,'Data Input'!L16,'Data Input'!O16,'Data Input'!Q16,'Data Input'!R16,'Data Input'!U16))","v":""},{"$f":"IF(G11=\"\",\"\",G11/COUNTIF('Data Input'!$C$8:$AA$8,\"+\"))","v":""},{"$f":"IF(ISBLANK('Data Input'!A16),\"\",SUM('Data Input'!D16,'Data Input'!E16,'Data Input'!K16,'Data Input'!M16,'Data Input'!Y16))","v":""},{"$f":"IF(I11=\"\",\"\",I11/COUNTIF('Data Input'!$C$8:$AA$8,\"-\"))","v":""},{"$f":"IF(ISBLANK('Data Input'!A16),\"\",SUM('Data Input'!H16,'Data Input'!I16,'Data Input'!N16,'Data Input'!S16))","v":""},{"$f":"IF(K11=\"\",\"\",K11/COUNTIF('Data Input'!$C$8:$AA$8,\"x\"))","v":""},{"$f":"IF(ISBLANK('Data Input'!A16),\"\",SUM('Data Input'!P16,'Data Input'!V16,'Data Input'!W16))","v":""},{"$f":"IF(M11=\"\",\"\",M11/COUNTIF('Data Input'!$C$8:$AA$8,\"÷\"))","v":""},{"$f":"IF(ISBLANK('Data Input'!A16),\"\",SUM('Data Input'!T16,'Data Input'!X16,'Data Input'!Z16,'Data Input'!AA16))","v":""},{"$f":"IF(O11=\"\",\"\",O11/COUNTIF('Data Input'!$C$8:$AA$8,\"F\"))","v":""}]
[{"$f":"IF('Data Input'!A17=0,\"\",'Data Input'!A17)","v":""},{"$f":"IF(ISBLANK('Data Input'!A17),\"\",COUNTIF('Data Input'!C17:AA17,\"\"))","v":""},{"$f":"IF(ISBLANK('Data Input'!A17),\"\",COUNTIF('Data Input'!C17:AA17,\"0\"))","v":""},{"$f":"IF(ISBLANK('Data Input'!A17),\"\",SUM(B12,C12))","v":""},{"$f":"IF(ISBLANK('Data Input'!A17),\"\",SUM('Data Input'!C17:AA17))","v":""},{"$f":"IF(E12=\"\",\"\",E12/(COUNTA('Data Input'!$C$8:$AA$8)))","v":""},{"$f":"IF(ISBLANK('Data Input'!A17),\"\",SUM('Data Input'!C17,'Data Input'!F17,'Data Input'!G17,'Data Input'!J17,'Data Input'!L17,'Data Input'!O17,'Data Input'!Q17,'Data Input'!R17,'Data Input'!U17))","v":""},{"$f":"IF(G12=\"\",\"\",G12/COUNTIF('Data Input'!$C$8:$AA$8,\"+\"))","v":""},{"$f":"IF(ISBLANK('Data Input'!A17),\"\",SUM('Data Input'!D17,'Data Input'!E17,'Data Input'!K17,'Data Input'!M17,'Data Input'!Y17))","v":""},{"$f":"IF(I12=\"\",\"\",I12/COUNTIF('Data Input'!$C$8:$AA$8,\"-\"))","v":""},{"$f":"IF(ISBLANK('Data Input'!A17),\"\",SUM('Data Input'!H17,'Data Input'!I17,'Data Input'!N17,'Data Input'!S17))","v":""},{"$f":"IF(K12=\"\",\"\",K12/COUNTIF('Data Input'!$C$8:$AA$8,\"x\"))","v":""},{"$f":"IF(ISBLANK('Data Input'!A17),\"\",SUM('Data Input'!P17,'Data Input'!V17,'Data Input'!W17))","v":""},{"$f":"IF(M12=\"\",\"\",M12/COUNTIF('Data Input'!$C$8:$AA$8,\"÷\"))","v":""},{"$f":"IF(ISBLANK('Data Input'!A17),\"\",SUM('Data Input'!T17,'Data Input'!X17,'Data Input'!Z17,'Data Input'!AA17))","v":""},{"$f":"IF(O12=\"\",\"\",O12/COUNTIF('Data Input'!$C$8:$AA$8,\"F\"))","v":""}]
[{"$f":"IF('Data Input'!A18=0,\"\",'Data Input'!A18)","v":""},{"$f":"IF(ISBLANK('Data Input'!A18),\"\",COUNTIF('Data Input'!C18:AA18,\"\"))","v":""},{"$f":"IF(ISBLANK('Data Input'!A18),\"\",COUNTIF('Data Input'!C18:AA18,\"0\"))","v":""},{"$f":"IF(ISBLANK('Data Input'!A18),\"\",SUM(B13,C13))","v":""},{"$f":"IF(ISBLANK('Data Input'!A18),\"\",SUM('Data Input'!C18:AA18))","v":""},{"$f":"IF(E13=\"\",\"\",E13/(COUNTA('Data Input'!$C$8:$AA$8)))","v":""},{"$f":"IF(ISBLANK('Data Input'!A18),\"\",SUM('Data Input'!C18,'Data Input'!F18,'Data Input'!G18,'Data Input'!J18,'Data Input'!L18,'Data Input'!O18,'Data Input'!Q18,'Data Input'!R18,'Data Input'!U18))","v":""},{"$f":"IF(G13=\"\",\"\",G13/COUNTIF('Data Input'!$C$8:$AA$8,\"+\"))","v":""},{"$f":"IF(ISBLANK('Data Input'!A18),\"\",SUM('Data Input'!D18,'Data Input'!E18,'Data Input'!K18,'Data Input'!M18,'Data Input'!Y18))","v":""},{"$f":"IF(I13=\"\",\"\",I13/COUNTIF('Data Input'!$C$8:$AA$8,\"-\"))","v":""},{"$f":"IF(ISBLANK('Data Input'!A18),\"\",SUM('Data Input'!H18,'Data Input'!I18,'Data Input'!N18,'Data Input'!S18))","v":""},{"$f":"IF(K13=\"\",\"\",K13/COUNTIF('Data Input'!$C$8:$AA$8,\"x\"))","v":""},{"$f":"IF(ISBLANK('Data Input'!A18),\"\",SUM('Data Input'!P18,'Data Input'!V18,'Data Input'!W18))","v":""},{"$f":"IF(M13=\"\",\"\",M13/COUNTIF('Data Input'!$C$8:$AA$8,\"÷\"))","v":""},{"$f":"IF(ISBLANK('Data Input'!A18),\"\",SUM('Data Input'!T18,'Data Input'!X18,'Data Input'!Z18,'Data Input'!AA18))","v":""},{"$f":"IF(O13=\"\",\"\",O13/COUNTIF('Data Input'!$C$8:$AA$8,\"F\"))","v":""}]
[{"$f":"IF('Data Input'!A19=0,\"\",'Data Input'!A19)","v":""},{"$f":"IF(ISBLANK('Data Input'!A19),\"\",COUNTIF('Data Input'!C19:AA19,\"\"))","v":""},{"$f":"IF(ISBLANK('Data Input'!A19),\"\",COUNTIF('Data Input'!C19:AA19,\"0\"))","v":""},{"$f":"IF(ISBLANK('Data Input'!A19),\"\",SUM(B14,C14))","v":""},{"$f":"IF(ISBLANK('Data Input'!A19),\"\",SUM('Data Input'!C19:AA19))","v":""},{"$f":"IF(E14=\"\",\"\",E14/(COUNTA('Data Input'!$C$8:$AA$8)))","v":""},{"$f":"IF(ISBLANK('Data Input'!A19),\"\",SUM('Data Input'!C19,'Data Input'!F19,'Data Input'!G19,'Data Input'!J19,'Data Input'!L19,'Data Input'!O19,'Data Input'!Q19,'Data Input'!R19,'Data Input'!U19))","v":""},{"$f":"IF(G14=\"\",\"\",G14/COUNTIF('Data Input'!$C$8:$AA$8,\"+\"))","v":""},{"$f":"IF(ISBLANK('Data Input'!A19),\"\",SUM('Data Input'!D19,'Data Input'!E19,'Data Input'!K19,'Data Input'!M19,'Data Input'!Y19))","v":""},{"$f":"IF(I14=\"\",\"\",I14/COUNTIF('Data Input'!$C$8:$AA$8,\"-\"))","v":""},{"$f":"IF(ISBLANK('Data Input'!A19),\"\",SUM('Data Input'!H19,'Data Input'!I19,'Data Input'!N19,'Data Input'!S19))","v":""},{"$f":"IF(K14=\"\",\"\",K14/COUNTIF('Data Input'!$C$8:$AA$8,\"x\"))","v":""},{"$f":"IF(ISBLANK('Data Input'!A19),\"\",SUM('Data Input'!P19,'Data Input'!V19,'Data Input'!W19))","v":""},{"$f":"IF(M14=\"\",\"\",M14/COUNTIF('Data Input'!$C$8:$AA$8,\"÷\"))","v":""},{"$f":"IF(ISBLANK('Data Input'!A19),\"\",SUM('Data Input'!T19,'Data Input'!X19,'Data Input'!Z19,'Data Input'!AA19))","v":""},{"$f":"IF(O14=\"\",\"\",O14/COUNTIF('Data Input'!$C$8:$AA$8,\"F\"))","v":""}]
[{"$f":"IF('Data Input'!A20=0,\"\",'Data Input'!A20)","v":""},{"$f":"IF(ISBLANK('Data Input'!A20),\"\",COUNTIF('Data Input'!C20:AA20,\"\"))","v":""},{"$f":"IF(ISBLANK('Data Input'!A20),\"\",COUNTIF('Data Input'!C20:AA20,\"0\"))","v":""},{"$f":"IF(ISBLANK('Data Input'!A20),\"\",SUM(B15,C15))","v":""},{"$f":"IF(ISBLANK('Data Input'!A20),\"\",SUM('Data Input'!C20:AA20))","v":""},{"$f":"IF(E15=\"\",\"\",E15/(COUNTA('Data Input'!$C$8:$AA$8)))","v":""},{"$f":"IF(ISBLANK('Data Input'!A20),\"\",SUM('Data Input'!C20,'Data Input'!F20,'Data Input'!G20,'Data Input'!J20,'Data Input'!L20,'Data Input'!O20,'Data Input'!Q20,'Data Input'!R20,'Data Input'!U20))","v":""},{"$f":"IF(G15=\"\",\"\",G15/COUNTIF('Data Input'!$C$8:$AA$8,\"+\"))","v":""},{"$f":"IF(ISBLANK('Data Input'!A20),\"\",SUM('Data Input'!D20,'Data Input'!E20,'Data Input'!K20,'Data Input'!M20,'Data Input'!Y20))","v":""},{"$f":"IF(I15=\"\",\"\",I15/COUNTIF('Data Input'!$C$8:$AA$8,\"-\"))","v":""},{"$f":"IF(ISBLANK('Data Input'!A20),\"\",SUM('Data Input'!H20,'Data Input'!I20,'Data Input'!N20,'Data Input'!S20))","v":""},{"$f":"IF(K15=\"\",\"\",K15/COUNTIF('Data Input'!$C$8:$AA$8,\"x\"))","v":""},{"$f":"IF(ISBLANK('Data Input'!A20),\"\",SUM('Data Input'!P20,'Data Input'!V20,'Data Input'!W20))","v":""},{"$f":"IF(M15=\"\",\"\",M15/COUNTIF('Data Input'!$C$8:$AA$8,\"÷\"))","v":""},{"$f":"IF(ISBLANK('Data Input'!A20),\"\",SUM('Data Input'!T20,'Data Input'!X20,'Data Input'!Z20,'Data Input'!AA20))","v":""},{"$f":"IF(O15=\"\",\"\",O15/COUNTIF('Data Input'!$C$8:$AA$8,\"F\"))","v":""}]
[{"$f":"IF('Data Input'!A21=0,\"\",'Data Input'!A21)","v":""},{"$f":"IF(ISBLANK('Data Input'!A21),\"\",COUNTIF('Data Input'!C21:AA21,\"\"))","v":""},{"$f":"IF(ISBLANK('Data Input'!A21),\"\",COUNTIF('Data Input'!C21:AA21,\"0\"))","v":""},{"$f":"IF(ISBLANK('Data Input'!A21),\"\",SUM(B16,C16))","v":""},{"$f":"IF(ISBLANK('Data Input'!A21),\"\",SUM('Data Input'!C21:AA21))","v":""},{"$f":"IF(E16=\"\",\"\",E16/(COUNTA('Data Input'!$C$8:$AA$8)))","v":""},{"$f":"IF(ISBLANK('Data Input'!A21),\"\",SUM('Data Input'!C21,'Data Input'!F21,'Data Input'!G21,'Data Input'!J21,'Data Input'!L21,'Data Input'!O21,'Data Input'!Q21,'Data Input'!R21,'Data Input'!U21))","v":""},{"$f":"IF(G16=\"\",\"\",G16/COUNTIF('Data Input'!$C$8:$AA$8,\"+\"))","v":""},{"$f":"IF(ISBLANK('Data Input'!A21),\"\",SUM('Data Input'!D21,'Data Input'!E21,'Data Input'!K21,'Data Input'!M21,'Data Input'!Y21))","v":""},{"$f":"IF(I16=\"\",\"\",I16/COUNTIF('Data Input'!$C$8:$AA$8,\"-\"))","v":""},{"$f":"IF(ISBLANK('Data Input'!A21),\"\",SUM('Data Input'!H21,'Data Input'!I21,'Data Input'!N21,'Data Input'!S21))","v":""},{"$f":"IF(K16=\"\",\"\",K16/COUNTIF('Data Input'!$C$8:$AA$8,\"x\"))","v":""},{"$f":"IF(ISBLANK('Data Input'!A21),\"\",SUM('Data Input'!P21,'Data Input'!V21,'Data Input'!W21))","v":""},{"$f":"IF(M16=\"\",\"\",M16/COUNTIF('Data Input'!$C$8:$AA$8,\"÷\"))","v":""},{"$f":"IF(ISBLANK('Data Input'!A21),\"\",SUM('Data Input'!T21,'Data Input'!X21,'Data Input'!Z21,'Data Input'!AA21))","v":""},{"$f":"IF(O16=\"\",\"\",O16/COUNTIF('Data Input'!$C$8:$AA$8,\"F\"))","v":""}]
[{"$f":"IF('Data Input'!A22=0,\"\",'Data Input'!A22)","v":""},{"$f":"IF(ISBLANK('Data Input'!A22),\"\",COUNTIF('Data Input'!C22:AA22,\"\"))","v":""},{"$f":"IF(ISBLANK('Data Input'!A22),\"\",COUNTIF('Data Input'!C22:AA22,\"0\"))","v":""},{"$f":"IF(ISBLANK('Data Input'!A22),\"\",SUM(B17,C17))","v":""},{"$f":"IF(ISBLANK('Data Input'!A22),\"\",SUM('Data Input'!C22:AA22))","v":""},{"$f":"IF(E17=\"\",\"\",E17/(COUNTA('Data Input'!$C$8:$AA$8)))","v":""},{"$f":"IF(ISBLANK('Data Input'!A22),\"\",SUM('Data Input'!C22,'Data Input'!F22,'Data Input'!G22,'Data Input'!J22,'Data Input'!L22,'Data Input'!O22,'Data Input'!Q22,'Data Input'!R22,'Data Input'!U22))","v":""},{"$f":"IF(G17=\"\",\"\",G17/COUNTIF('Data Input'!$C$8:$AA$8,\"+\"))","v":""},{"$f":"IF(ISBLANK('Data Input'!A22),\"\",SUM('Data Input'!D22,'Data Input'!E22,'Data Input'!K22,'Data Input'!M22,'Data Input'!Y22))","v":""},{"$f":"IF(I17=\"\",\"\",I17/COUNTIF('Data Input'!$C$8:$AA$8,\"-\"))","v":""},{"$f":"IF(ISBLANK('Data Input'!A22),\"\",SUM('Data Input'!H22,'Data Input'!I22,'Data Input'!N22,'Data Input'!S22))","v":""},{"$f":"IF(K17=\"\",\"\",K17/COUNTIF('Data Input'!$C$8:$AA$8,\"x\"))","v":""},{"$f":"IF(ISBLANK('Data Input'!A22),\"\",SUM('Data Input'!P22,'Data Input'!V22,'Data Input'!W22))","v":""},{"$f":"IF(M17=\"\",\"\",M17/COUNTIF('Data Input'!$C$8:$AA$8,\"÷\"))","v":""},{"$f":"IF(ISBLANK('Data Input'!A22),\"\",SUM('Data Input'!T22,'Data Input'!X22,'Data Input'!Z22,'Data Input'!AA22))","v":""},{"$f":"IF(O17=\"\",\"\",O17/COUNTIF('Data Input'!$C$8:$AA$8,\"F\"))","v":""}]
[{"$f":"IF('Data Input'!A23=0,\"\",'Data Input'!A23)","v":""},{"$f":"IF(ISBLANK('Data Input'!A23),\"\",COUNTIF('Data Input'!C23:AA23,\"\"))","v":""},{"$f":"IF(ISBLANK('Data Input'!A23),\"\",COUNTIF('Data Input'!C23:AA23,\"0\"))","v":""},{"$f":"IF(ISBLANK('Data Input'!A23),\"\",SUM(B18,C18))","v":""},{"$f":"IF(ISBLANK('Data Input'!A23),\"\",SUM('Data Input'!C23:AA23))","v":""},{"$f":"IF(E18=\"\",\"\",E18/(COUNTA('Data Input'!$C$8:$AA$8)))","v":""},{"$f":"IF(ISBLANK('Data Input'!A23),\"\",SUM('Data Input'!C23,'Data Input'!F23,'Data Input'!G23,'Data Input'!J23,'Data Input'!L23,'Data Input'!O23,'Data Input'!Q23,'Data Input'!R23,'Data Input'!U23))","v":""},{"$f":"IF(G18=\"\",\"\",G18/COUNTIF('Data Input'!$C$8:$AA$8,\"+\"))","v":""},{"$f":"IF(ISBLANK('Data Input'!A23),\"\",SUM('Data Input'!D23,'Data Input'!E23,'Data Input'!K23,'Data Input'!M23,'Data Input'!Y23))","v":""},{"$f":"IF(I18=\"\",\"\",I18/COUNTIF('Data Input'!$C$8:$AA$8,\"-\"))","v":""},{"$f":"IF(ISBLANK('Data Input'!A23),\"\",SUM('Data Input'!H23,'Data Input'!I23,'Data Input'!N23,'Data Input'!S23))","v":""},{"$f":"IF(K18=\"\",\"\",K18/COUNTIF('Data Input'!$C$8:$AA$8,\"x\"))","v":""},{"$f":"IF(ISBLANK('Data Input'!A23),\"\",SUM('Data Input'!P23,'Data Input'!V23,'Data Input'!W23))","v":""},{"$f":"IF(M18=\"\",\"\",M18/COUNTIF('Data Input'!$C$8:$AA$8,\"÷\"))","v":""},{"$f":"IF(ISBLANK('Data Input'!A23),\"\",SUM('Data Input'!T23,'Data Input'!X23,'Data Input'!Z23,'Data Input'!AA23))","v":""},{"$f":"IF(O18=\"\",\"\",O18/COUNTIF('Data Input'!$C$8:$AA$8,\"F\"))","v":""}]
[{"$f":"IF('Data Input'!A24=0,\"\",'Data Input'!A24)","v":""},{"$f":"IF(ISBLANK('Data Input'!A24),\"\",COUNTIF('Data Input'!C24:AA24,\"\"))","v":""},{"$f":"IF(ISBLANK('Data Input'!A24),\"\",COUNTIF('Data Input'!C24:AA24,\"0\"))","v":""},{"$f":"IF(ISBLANK('Data Input'!A24),\"\",SUM(B19,C19))","v":""},{"$f":"IF(ISBLANK('Data Input'!A24),\"\",SUM('Data Input'!C24:AA24))","v":""},{"$f":"IF(E19=\"\",\"\",E19/(COUNTA('Data Input'!$C$8:$AA$8)))","v":""},{"$f":"IF(ISBLANK('Data Input'!A24),\"\",SUM('Data Input'!C24,'Data Input'!F24,'Data Input'!G24,'Data Input'!J24,'Data Input'!L24,'Data Input'!O24,'Data Input'!Q24,'Data Input'!R24,'Data Input'!U24))","v":""},{"$f":"IF(G19=\"\",\"\",G19/COUNTIF('Data Input'!$C$8:$AA$8,\"+\"))","v":""},{"$f":"IF(ISBLANK('Data Input'!A24),\"\",SUM('Data Input'!D24,'Data Input'!E24,'Data Input'!K24,'Data Input'!M24,'Data Input'!Y24))","v":""},{"$f":"IF(I19=\"\",\"\",I19/COUNTIF('Data Input'!$C$8:$AA$8,\"-\"))","v":""},{"$f":"IF(ISBLANK('Data Input'!A24),\"\",SUM('Data Input'!H24,'Data Input'!I24,'Data Input'!N24,'Data Input'!S24))","v":""},{"$f":"IF(K19=\"\",\"\",K19/COUNTIF('Data Input'!$C$8:$AA$8,\"x\"))","v":""},{"$f":"IF(ISBLANK('Data Input'!A24),\"\",SUM('Data Input'!P24,'Data Input'!V24,'Data Input'!W24))","v":""},{"$f":"IF(M19=\"\",\"\",M19/COUNTIF('Data Input'!$C$8:$AA$8,\"÷\"))","v":""},{"$f":"IF(ISBLANK('Data Input'!A24),\"\",SUM('Data Input'!T24,'Data Input'!X24,'Data Input'!Z24,'Data Input'!AA24))","v":""},{"$f":"IF(O19=\"\",\"\",O19/COUNTIF('Data Input'!$C$8:$AA$8,\"F\"))","v":""}]
[{"$f":"IF('Data Input'!A25=0,\"\",'Data Input'!A25)","v":""},{"$f":"IF(ISBLANK('Data Input'!A25),\"\",COUNTIF('Data Input'!C25:AA25,\"\"))","v":""},{"$f":"IF(ISBLANK('Data Input'!A25),\"\",COUNTIF('Data Input'!C25:AA25,\"0\"))","v":""},{"$f":"IF(ISBLANK('Data Input'!A25),\"\",SUM(B20,C20))","v":""},{"$f":"IF(ISBLANK('Data Input'!A25),\"\",SUM('Data Input'!C25:AA25))","v":""},{"$f":"IF(E20=\"\",\"\",E20/(COUNTA('Data Input'!$C$8:$AA$8)))","v":""},{"$f":"IF(ISBLANK('Data Input'!A25),\"\",SUM('Data Input'!C25,'Data Input'!F25,'Data Input'!G25,'Data Input'!J25,'Data Input'!L25,'Data Input'!O25,'Data Input'!Q25,'Data Input'!R25,'Data Input'!U25))","v":""},{"$f":"IF(G20=\"\",\"\",G20/COUNTIF('Data Input'!$C$8:$AA$8,\"+\"))","v":""},{"$f":"IF(ISBLANK('Data Input'!A25),\"\",SUM('Data Input'!D25,'Data Input'!E25,'Data Input'!K25,'Data Input'!M25,'Data Input'!Y25))","v":""},{"$f":"IF(I20=\"\",\"\",I20/COUNTIF('Data Input'!$C$8:$AA$8,\"-\"))","v":""},{"$f":"IF(ISBLANK('Data Input'!A25),\"\",SUM('Data Input'!H25,'Data Input'!I25,'Data Input'!N25,'Data Input'!S25))","v":""},{"$f":"IF(K20=\"\",\"\",K20/COUNTIF('Data Input'!$C$8:$AA$8,\"x\"))","v":""},{"$f":"IF(ISBLANK('Data Input'!A25),\"\",SUM('Data Input'!P25,'Data Input'!V25,'Data Input'!W25))","v":""},{"$f":"IF(M20=\"\",\"\",M20/COUNTIF('Data Input'!$C$8:$AA$8,\"÷\"))","v":""},{"$f":"IF(ISBLANK('Data Input'!A25),\"\",SUM('Data Input'!T25,'Data Input'!X25,'Data Input'!Z25,'Data Input'!AA25))","v":""},{"$f":"IF(O20=\"\",\"\",O20/COUNTIF('Data Input'!$C$8:$AA$8,\"F\"))","v":""}]
[{"$f":"IF('Data Input'!A26=0,\"\",'Data Input'!A26)","v":""},{"$f":"IF(ISBLANK('Data Input'!A26),\"\",COUNTIF('Data Input'!C26:AA26,\"\"))","v":""},{"$f":"IF(ISBLANK('Data Input'!A26),\"\",COUNTIF('Data Input'!C26:AA26,\"0\"))","v":""},{"$f":"IF(ISBLANK('Data Input'!A26),\"\",SUM(B21,C21))","v":""},{"$f":"IF(ISBLANK('Data Input'!A26),\"\",SUM('Data Input'!C26:AA26))","v":""},{"$f":"IF(E21=\"\",\"\",E21/(COUNTA('Data Input'!$C$8:$AA$8)))","v":""},{"$f":"IF(ISBLANK('Data Input'!A26),\"\",SUM('Data Input'!C26,'Data Input'!F26,'Data Input'!G26,'Data Input'!J26,'Data Input'!L26,'Data Input'!O26,'Data Input'!Q26,'Data Input'!R26,'Data Input'!U26))","v":""},{"$f":"IF(G21=\"\",\"\",G21/COUNTIF('Data Input'!$C$8:$AA$8,\"+\"))","v":""},{"$f":"IF(ISBLANK('Data Input'!A26),\"\",SUM('Data Input'!D26,'Data Input'!E26,'Data Input'!K26,'Data Input'!M26,'Data Input'!Y26))","v":""},{"$f":"IF(I21=\"\",\"\",I21/COUNTIF('Data Input'!$C$8:$AA$8,\"-\"))","v":""},{"$f":"IF(ISBLANK('Data Input'!A26),\"\",SUM('Data Input'!H26,'Data Input'!I26,'Data Input'!N26,'Data Input'!S26))","v":""},{"$f":"IF(K21=\"\",\"\",K21/COUNTIF('Data Input'!$C$8:$AA$8,\"x\"))","v":""},{"$f":"IF(ISBLANK('Data Input'!A26),\"\",SUM('Data Input'!P26,'Data Input'!V26,'Data Input'!W26))","v":""},{"$f":"IF(M21=\"\",\"\",M21/COUNTIF('Data Input'!$C$8:$AA$8,\"÷\"))","v":""},{"$f":"IF(ISBLANK('Data Input'!A26),\"\",SUM('Data Input'!T26,'Data Input'!X26,'Data Input'!Z26,'Data Input'!AA26))","v":""},{"$f":"IF(O21=\"\",\"\",O21/COUNTIF('Data Input'!$C$8:$AA$8,\"F\"))","v":""}]
[{"$f":"IF('Data Input'!A27=0,\"\",'Data Input'!A27)","v":""},{"$f":"IF(ISBLANK('Data Input'!A27),\"\",COUNTIF('Data Input'!C27:AA27,\"\"))","v":""},{"$f":"IF(ISBLANK('Data Input'!A27),\"\",COUNTIF('Data Input'!C27:AA27,\"0\"))","v":""},{"$f":"IF(ISBLANK('Data Input'!A27),\"\",SUM(B22,C22))","v":""},{"$f":"IF(ISBLANK('Data Input'!A27),\"\",SUM('Data Input'!C27:AA27))","v":""},{"$f":"IF(E22=\"\",\"\",E22/(COUNTA('Data Input'!$C$8:$AA$8)))","v":""},{"$f":"IF(ISBLANK('Data Input'!A27),\"\",SUM('Data Input'!C27,'Data Input'!F27,'Data Input'!G27,'Data Input'!J27,'Data Input'!L27,'Data Input'!O27,'Data Input'!Q27,'Data Input'!R27,'Data Input'!U27))","v":""},{"$f":"IF(G22=\"\",\"\",G22/COUNTIF('Data Input'!$C$8:$AA$8,\"+\"))","v":""},{"$f":"IF(ISBLANK('Data Input'!A27),\"\",SUM('Data Input'!D27,'Data Input'!E27,'Data Input'!K27,'Data Input'!M27,'Data Input'!Y27))","v":""},{"$f":"IF(I22=\"\",\"\",I22/COUNTIF('Data Input'!$C$8:$AA$8,\"-\"))","v":""},{"$f":"IF(ISBLANK('Data Input'!A27),\"\",SUM('Data Input'!H27,'Data Input'!I27,'Data Input'!N27,'Data Input'!S27))","v":""},{"$f":"IF(K22=\"\",\"\",K22/COUNTIF('Data Input'!$C$8:$AA$8,\"x\"))","v":""},{"$f":"IF(ISBLANK('Data Input'!A27),\"\",SUM('Data Input'!P27,'Data Input'!V27,'Data Input'!W27))","v":""},{"$f":"IF(M22=\"\",\"\",M22/COUNTIF('Data Input'!$C$8:$AA$8,\"÷\"))","v":""},{"$f":"IF(ISBLANK('Data Input'!A27),\"\",SUM('Data Input'!T27,'Data Input'!X27,'Data Input'!Z27,'Data Input'!AA27))","v":""},{"$f":"IF(O22=\"\",\"\",O22/COUNTIF('Data Input'!$C$8:$AA$8,\"F\"))","v":""}]
[{"$f":"IF('Data Input'!A28=0,\"\",'Data Input'!A28)","v":""},{"$f":"IF(ISBLANK('Data Input'!A28),\"\",COUNTIF('Data Input'!C28:AA28,\"\"))","v":""},{"$f":"IF(ISBLANK('Data Input'!A28),\"\",COUNTIF('Data Input'!C28:AA28,\"0\"))","v":""},{"$f":"IF(ISBLANK('Data Input'!A28),\"\",SUM(B23,C23))","v":""},{"$f":"IF(ISBLANK('Data Input'!A28),\"\",SUM('Data Input'!C28:AA28))","v":""},{"$f":"IF(E23=\"\",\"\",E23/(COUNTA('Data Input'!$C$8:$AA$8)))","v":""},{"$f":"IF(ISBLANK('Data Input'!A28),\"\",SUM('Data Input'!C28,'Data Input'!F28,'Data Input'!G28,'Data Input'!J28,'Data Input'!L28,'Data Input'!O28,'Data Input'!Q28,'Data Input'!R28,'Data Input'!U28))","v":""},{"$f":"IF(G23=\"\",\"\",G23/COUNTIF('Data Input'!$C$8:$AA$8,\"+\"))","v":""},{"$f":"IF(ISBLANK('Data Input'!A28),\"\",SUM('Data Input'!D28,'Data Input'!E28,'Data Input'!K28,'Data Input'!M28,'Data Input'!Y28))","v":""},{"$f":"IF(I23=\"\",\"\",I23/COUNTIF('Data Input'!$C$8:$AA$8,\"-\"))","v":""},{"$f":"IF(ISBLANK('Data Input'!A28),\"\",SUM('Data Input'!H28,'Data Input'!I28,'Data Input'!N28,'Data Input'!S28))","v":""},{"$f":"IF(K23=\"\",\"\",K23/COUNTIF('Data Input'!$C$8:$AA$8,\"x\"))","v":""},{"$f":"IF(ISBLANK('Data Input'!A28),\"\",SUM('Data Input'!P28,'Data Input'!V28,'Data Input'!W28))","v":""},{"$f":"IF(M23=\"\",\"\",M23/COUNTIF('Data Input'!$C$8:$AA$8,\"÷\"))","v":""},{"$f":"IF(ISBLANK('Data Input'!A28),\"\",SUM('Data Input'!T28,'Data Input'!X28,'Data Input'!Z28,'Data Input'!AA28))","v":""},{"$f":"IF(O23=\"\",\"\",O23/COUNTIF('Data Input'!$C$8:$AA$8,\"F\"))","v":""}]
[{"$f":"IF('Data Input'!A29=0,\"\",'Data Input'!A29)","v":""},{"$f":"IF(ISBLANK('Data Input'!A29),\"\",COUNTIF('Data Input'!C29:AA29,\"\"))","v":""},{"$f":"IF(ISBLANK('Data Input'!A29),\"\",COUNTIF('Data Input'!C29:AA29,\"0\"))","v":""},{"$f":"IF(ISBLANK('Data Input'!A29),\"\",SUM(B24,C24))","v":""},{"$f":"IF(ISBLANK('Data Input'!A29),\"\",SUM('Data Input'!C29:AA29))","v":""},{"$f":"IF(E24=\"\",\"\",E24/(COUNTA('Data Input'!$C$8:$AA$8)))","v":""},{"$f":"IF(ISBLANK('Data Input'!A29),\"\",SUM('Data Input'!C29,'Data Input'!F29,'Data Input'!G29,'Data Input'!J29,'Data Input'!L29,'Data Input'!O29,'Data Input'!Q29,'Data Input'!R29,'Data Input'!U29))","v":""},{"$f":"IF(G24=\"\",\"\",G24/COUNTIF('Data Input'!$C$8:$AA$8,\"+\"))","v":""},{"$f":"IF(ISBLANK('Data Input'!A29),\"\",SUM('Data Input'!D29,'Data Input'!E29,'Data Input'!K29,'Data Input'!M29,'Data Input'!Y29))","v":""},{"$f":"IF(I24=\"\",\"\",I24/COUNTIF('Data Input'!$C$8:$AA$8,\"-\"))","v":""},{"$f":"IF(ISBLANK('Data Input'!A29),\"\",SUM('Data Input'!H29,'Data Input'!I29,'Data Input'!N29,'Data Input'!S29))","v":""},{"$f":"IF(K24=\"\",\"\",K24/COUNTIF('Data Input'!$C$8:$AA$8,\"x\"))","v":""},{"$f":"IF(ISBLANK('Data Input'!A29),\"\",SUM('Data Input'!P29,'Data Input'!V29,'Data Input'!W29))","v":""},{"$f":"IF(M24=\"\",\"\",M24/COUNTIF('Data Input'!$C$8:$AA$8,\"÷\"))","v":""},{"$f":"IF(ISBLANK('Data Input'!A29),\"\",SUM('Data Input'!T29,'Data Input'!X29,'Data Input'!Z29,'Data Input'!AA29))","v":""},{"$f":"IF(O24=\"\",\"\",O24/COUNTIF('Data Input'!$C$8:$AA$8,\"F\"))","v":""}]
[{"$f":"IF('Data Input'!A30=0,\"\",'Data Input'!A30)","v":""},{"$f":"IF(ISBLANK('Data Input'!A30),\"\",COUNTIF('Data Input'!C30:AA30,\"\"))","v":""},{"$f":"IF(ISBLANK('Data Input'!A30),\"\",COUNTIF('Data Input'!C30:AA30,\"0\"))","v":""},{"$f":"IF(ISBLANK('Data Input'!A30),\"\",SUM(B25,C25))","v":""},{"$f":"IF(ISBLANK('Data Input'!A30),\"\",SUM('Data Input'!C30:AA30))","v":""},{"$f":"IF(E25=\"\",\"\",E25/(COUNTA('Data Input'!$C$8:$AA$8)))","v":""},{"$f":"IF(ISBLANK('Data Input'!A30),\"\",SUM('Data Input'!C30,'Data Input'!F30,'Data Input'!G30,'Data Input'!J30,'Data Input'!L30,'Data Input'!O30,'Data Input'!Q30,'Data Input'!R30,'Data Input'!U30))","v":""},{"$f":"IF(G25=\"\",\"\",G25/COUNTIF('Data Input'!$C$8:$AA$8,\"+\"))","v":""},{"$f":"IF(ISBLANK('Data Input'!A30),\"\",SUM('Data Input'!D30,'Data Input'!E30,'Data Input'!K30,'Data Input'!M30,'Data Input'!Y30))","v":""},{"$f":"IF(I25=\"\",\"\",I25/COUNTIF('Data Input'!$C$8:$AA$8,\"-\"))","v":""},{"$f":"IF(ISBLANK('Data Input'!A30),\"\",SUM('Data Input'!H30,'Data Input'!I30,'Data Input'!N30,'Data Input'!S30))","v":""},{"$f":"IF(K25=\"\",\"\",K25/COUNTIF('Data Input'!$C$8:$AA$8,\"x\"))","v":""},{"$f":"IF(ISBLANK('Data Input'!A30),\"\",SUM('Data Input'!P30,'Data Input'!V30,'Data Input'!W30))","v":""},{"$f":"IF(M25=\"\",\"\",M25/COUNTIF('Data Input'!$C$8:$AA$8,\"÷\"))","v":""},{"$f":"IF(ISBLANK('Data Input'!A30),\"\",SUM('Data Input'!T30,'Data Input'!X30,'Data Input'!Z30,'Data Input'!AA30))","v":""},{"$f":"IF(O25=\"\",\"\",O25/COUNTIF('Data Input'!$C$8:$AA$8,\"F\"))","v":""}]
[{"$f":"IF('Data Input'!A31=0,\"\",'Data Input'!A31)","v":""},{"$f":"IF(ISBLANK('Data Input'!A31),\"\",COUNTIF('Data Input'!C31:AA31,\"\"))","v":""},{"$f":"IF(ISBLANK('Data Input'!A31),\"\",COUNTIF('Data Input'!C31:AA31,\"0\"))","v":""},{"$f":"IF(ISBLANK('Data Input'!A31),\"\",SUM(B26,C26))","v":""},{"$f":"IF(ISBLANK('Data Input'!A31),\"\",SUM('Data Input'!C31:AA31))","v":""},{"$f":"IF(E26=\"\",\"\",E26/(COUNTA('Data Input'!$C$8:$AA$8)))","v":""},{"$f":"IF(ISBLANK('Data Input'!A31),\"\",SUM('Data Input'!C31,'Data Input'!F31,'Data Input'!G31,'Data Input'!J31,'Data Input'!L31,'Data Input'!O31,'Data Input'!Q31,'Data Input'!R31,'Data Input'!U31))","v":""},{"$f":"IF(G26=\"\",\"\",G26/COUNTIF('Data Input'!$C$8:$AA$8,\"+\"))","v":""},{"$f":"IF(ISBLANK('Data Input'!A31),\"\",SUM('Data Input'!D31,'Data Input'!E31,'Data Input'!K31,'Data Input'!M31,'Data Input'!Y31))","v":""},{"$f":"IF(I26=\"\",\"\",I26/COUNTIF('Data Input'!$C$8:$AA$8,\"-\"))","v":""},{"$f":"IF(ISBLANK('Data Input'!A31),\"\",SUM('Data Input'!H31,'Data Input'!I31,'Data Input'!N31,'Data Input'!S31))","v":""},{"$f":"IF(K26=\"\",\"\",K26/COUNTIF('Data Input'!$C$8:$AA$8,\"x\"))","v":""},{"$f":"IF(ISBLANK('Data Input'!A31),\"\",SUM('Data Input'!P31,'Data Input'!V31,'Data Input'!W31))","v":""},{"$f":"IF(M26=\"\",\"\",M26/COUNTIF('Data Input'!$C$8:$AA$8,\"÷\"))","v":""},{"$f":"IF(ISBLANK('Data Input'!A31),\"\",SUM('Data Input'!T31,'Data Input'!X31,'Data Input'!Z31,'Data Input'!AA31))","v":""},{"$f":"IF(O26=\"\",\"\",O26/COUNTIF('Data Input'!$C$8:$AA$8,\"F\"))","v":""}]
[{"$f":"IF('Data Input'!A32=0,\"\",'Data Input'!A32)","v":""},{"$f":"IF(ISBLANK('Data Input'!A32),\"\",COUNTIF('Data Input'!C32:AA32,\"\"))","v":""},{"$f":"IF(ISBLANK('Data Input'!A32),\"\",COUNTIF('Data Input'!C32:AA32,\"0\"))","v":""},{"$f":"IF(ISBLANK('Data Input'!A32),\"\",SUM(B27,C27))","v":""},{"$f":"IF(ISBLANK('Data Input'!A32),\"\",SUM('Data Input'!C32:AA32))","v":""},{"$f":"IF(E27=\"\",\"\",E27/(COUNTA('Data Input'!$C$8:$AA$8)))","v":""},{"$f":"IF(ISBLANK('Data Input'!A32),\"\",SUM('Data Input'!C32,'Data Input'!F32,'Data Input'!G32,'Data Input'!J32,'Data Input'!L32,'Data Input'!O32,'Data Input'!Q32,'Data Input'!R32,'Data Input'!U32))","v":""},{"$f":"IF(G27=\"\",\"\",G27/COUNTIF('Data Input'!$C$8:$AA$8,\"+\"))","v":""},{"$f":"IF(ISBLANK('Data Input'!A32),\"\",SUM('Data Input'!D32,'Data Input'!E32,'Data Input'!K32,'Data Input'!M32,'Data Input'!Y32))","v":""},{"$f":"IF(I27=\"\",\"\",I27/COUNTIF('Data Input'!$C$8:$AA$8,\"-\"))","v":""},{"$f":"IF(ISBLANK('Data Input'!A32),\"\",SUM('Data Input'!H32,'Data Input'!I32,'Data Input'!N32,'Data Input'!S32))","v":""},{"$f":"IF(K27=\"\",\"\",K27/COUNTIF('Data Input'!$C$8:$AA$8,\"x\"))","v":""},{"$f":"IF(ISBLANK('Data Input'!A32),\"\",SUM('Data Input'!P32,'Data Input'!V32,'Data Input'!W32))","v":""},{"$f":"IF(M27=\"\",\"\",M27/COUNTIF('Data Input'!$C$8:$AA$8,\"÷\"))","v":""},{"$f":"IF(ISBLANK('Data Input'!A32),\"\",SUM('Data Input'!T32,'Data Input'!X32,'Data Input'!Z32,'Data Input'!AA32))","v":""},{"$f":"IF(O27=\"\",\"\",O27/COUNTIF('Data Input'!$C$8:$AA$8,\"F\"))","v":""}]
[{"$f":"IF('Data Input'!A33=0,\"\",'Data Input'!A33)","v":""},{"$f":"IF(ISBLANK('Data Input'!A33),\"\",COUNTIF('Data Input'!C33:AA33,\"\"))","v":""},{"$f":"IF(ISBLANK('Data Input'!A33),\"\",COUNTIF('Data Input'!C33:AA33,\"0\"))","v":""},{"$f":"IF(ISBLANK('Data Input'!A33),\"\",SUM(B28,C28))","v":""},{"$f":"IF(ISBLANK('Data Input'!A33),\"\",SUM('Data Input'!C33:AA33))","v":""},{"$f":"IF(E28=\"\",\"\",E28/(COUNTA('Data Input'!$C$8:$AA$8)))","v":""},{"$f":"IF(ISBLANK('Data Input'!A33),\"\",SUM('Data Input'!C33,'Data Input'!F33,'Data Input'!G33,'Data Input'!J33,'Data Input'!L33,'Data Input'!O33,'Data Input'!Q33,'Data Input'!R33,'Data Input'!U33))","v":""},{"$f":"IF(G28=\"\",\"\",G28/COUNTIF('Data Input'!$C$8:$AA$8,\"+\"))","v":""},{"$f":"IF(ISBLANK('Data Input'!A33),\"\",SUM('Data Input'!D33,'Data Input'!E33,'Data Input'!K33,'Data Input'!M33,'Data Input'!Y33))","v":""},{"$f":"IF(I28=\"\",\"\",I28/COUNTIF('Data Input'!$C$8:$AA$8,\"-\"))","v":""},{"$f":"IF(ISBLANK('Data Input'!A33),\"\",SUM('Data Input'!H33,'Data Input'!I33,'Data Input'!N33,'Data Input'!S33))","v":""},{"$f":"IF(K28=\"\",\"\",K28/COUNTIF('Data Input'!$C$8:$AA$8,\"x\"))","v":""},{"$f":"IF(ISBLANK('Data Input'!A33),\"\",SUM('Data Input'!P33,'Data Input'!V33,'Data Input'!W33))","v":""},{"$f":"IF(M28=\"\",\"\",M28/COUNTIF('Data Input'!$C$8:$AA$8,\"÷\"))","v":""},{"$f":"IF(ISBLANK('Data Input'!A33),\"\",SUM('Data Input'!T33,'Data Input'!X33,'Data Input'!Z33,'Data Input'!AA33))","v":""},{"$f":"IF(O28=\"\",\"\",O28/COUNTIF('Data Input'!$C$8:$AA$8,\"F\"))","v":""}]
[{"$f":"IF('Data Input'!A34=0,\"\",'Data Input'!A34)","v":""},{"$f":"IF(ISBLANK('Data Input'!A34),\"\",COUNTIF('Data Input'!C34:AA34,\"\"))","v":""},{"$f":"IF(ISBLANK('Data Input'!A34),\"\",COUNTIF('Data Input'!C34:AA34,\"0\"))","v":""},{"$f":"IF(ISBLANK('Data Input'!A34),\"\",SUM(B29,C29))","v":""},{"$f":"IF(ISBLANK('Data Input'!A34),\"\",SUM('Data Input'!C34:AA34))","v":""},{"$f":"IF(E29=\"\",\"\",E29/(COUNTA('Data Input'!$C$8:$AA$8)))","v":""},{"$f":"IF(ISBLANK('Data Input'!A34),\"\",SUM('Data Input'!C34,'Data Input'!F34,'Data Input'!G34,'Data Input'!J34,'Data Input'!L34,'Data Input'!O34,'Data Input'!Q34,'Data Input'!R34,'Data Input'!U34))","v":""},{"$f":"IF(G29=\"\",\"\",G29/COUNTIF('Data Input'!$C$8:$AA$8,\"+\"))","v":""},{"$f":"IF(ISBLANK('Data Input'!A34),\"\",SUM('Data Input'!D34,'Data Input'!E34,'Data Input'!K34,'Data Input'!M34,'Data Input'!Y34))","v":""},{"$f":"IF(I29=\"\",\"\",I29/COUNTIF('Data Input'!$C$8:$AA$8,\"-\"))","v":""},{"$f":"IF(ISBLANK('Data Input'!A34),\"\",SUM('Data Input'!H34,'Data Input'!I34,'Data Input'!N34,'Data Input'!S34))","v":""},{"$f":"IF(K29=\"\",\"\",K29/COUNTIF('Data Input'!$C$8:$AA$8,\"x\"))","v":""},{"$f":"IF(ISBLANK('Data Input'!A34),\"\",SUM('Data Input'!P34,'Data Input'!V34,'Data Input'!W34))","v":""},{"$f":"IF(M29=\"\",\"\",M29/COUNTIF('Data Input'!$C$8:$AA$8,\"÷\"))","v":""},{"$f":"IF(ISBLANK('Data Input'!A34),\"\",SUM('Data Input'!T34,'Data Input'!X34,'Data Input'!Z34,'Data Input'!AA34))","v":""},{"$f":"IF(O29=\"\",\"\",O29/COUNTIF('Data Input'!$C$8:$AA$8,\"F\"))","v":""}]
[{"$f":"IF('Data Input'!A35=0,\"\",'Data Input'!A35)","v":""},{"$f":"IF(ISBLANK('Data Input'!A35),\"\",COUNTIF('Data Input'!C35:AA35,\"\"))","v":""},{"$f":"IF(ISBLANK('Data Input'!A35),\"\",COUNTIF('Data Input'!C35:AA35,\"0\"))","v":""},{"$f":"IF(ISBLANK('Data Input'!A35),\"\",SUM(B30,C30))","v":""},{"$f":"IF(ISBLANK('Data Input'!A35),\"\",SUM('Data Input'!C35:AA35))","v":""},{"$f":"IF(E30=\"\",\"\",E30/(COUNTA('Data Input'!$C$8:$AA$8)))","v":""},{"$f":"IF(ISBLANK('Data Input'!A35),\"\",SUM('Data Input'!C35,'Data Input'!F35,'Data Input'!G35,'Data Input'!J35,'Data Input'!L35,'Data Input'!O35,'Data Input'!Q35,'Data Input'!R35,'Data Input'!U35))","v":""},{"$f":"IF(G30=\"\",\"\",G30/COUNTIF('Data Input'!$C$8:$AA$8,\"+\"))","v":""},{"$f":"IF(ISBLANK('Data Input'!A35),\"\",SUM('Data Input'!D35,'Data Input'!E35,'Data Input'!K35,'Data Input'!M35,'Data Input'!Y35))","v":""},{"$f":"IF(I30=\"\",\"\",I30/COUNTIF('Data Input'!$C$8:$AA$8,\"-\"))","v":""},{"$f":"IF(ISBLANK('Data Input'!A35),\"\",SUM('Data Input'!H35,'Data Input'!I35,'Data Input'!N35,'Data Input'!S35))","v":""},{"$f":"IF(K30=\"\",\"\",K30/COUNTIF('Data Input'!$C$8:$AA$8,\"x\"))","v":""},{"$f":"IF(ISBLANK('Data Input'!A35),\"\",SUM('Data Input'!P35,'Data Input'!V35,'Data Input'!W35))","v":""},{"$f":"IF(M30=\"\",\"\",M30/COUNTIF('Data Input'!$C$8:$AA$8,\"÷\"))","v":""},{"$f":"IF(ISBLANK('Data Input'!A35),\"\",SUM('Data Input'!T35,'Data Input'!X35,'Data Input'!Z35,'Data Input'!AA35))","v":""},{"$f":"IF(O30=\"\",\"\",O30/COUNTIF('Data Input'!$C$8:$AA$8,\"F\"))","v":""}]
[{"$f":"IF('Data Input'!A36=0,\"\",'Data Input'!A36)","v":""},{"$f":"IF(ISBLANK('Data Input'!A36),\"\",COUNTIF('Data Input'!C36:AA36,\"\"))","v":""},{"$f":"IF(ISBLANK('Data Input'!A36),\"\",COUNTIF('Data Input'!C36:AA36,\"0\"))","v":""},{"$f":"IF(ISBLANK('Data Input'!A36),\"\",SUM(B31,C31))","v":""},{"$f":"IF(ISBLANK('Data Input'!A36),\"\",SUM('Data Input'!C36:AA36))","v":""},{"$f":"IF(E31=\"\",\"\",E31/(COUNTA('Data Input'!$C$8:$AA$8)))","v":""},{"$f":"IF(ISBLANK('Data Input'!A36),\"\",SUM('Data Input'!C36,'Data Input'!F36,'Data Input'!G36,'Data Input'!J36,'Data Input'!L36,'Data Input'!O36,'Data Input'!Q36,'Data Input'!R36,'Data Input'!U36))","v":""},{"$f":"IF(G31=\"\",\"\",G31/COUNTIF('Data Input'!$C$8:$AA$8,\"+\"))","v":""},{"$f":"IF(ISBLANK('Data Input'!A36),\"\",SUM('Data Input'!D36,'Data Input'!E36,'Data Input'!K36,'Data Input'!M36,'Data Input'!Y36))","v":""},{"$f":"IF(I31=\"\",\"\",I31/COUNTIF('Data Input'!$C$8:$AA$8,\"-\"))","v":""},{"$f":"IF(ISBLANK('Data Input'!A36),\"\",SUM('Data Input'!H36,'Data Input'!I36,'Data Input'!N36,'Data Input'!S36))","v":""},{"$f":"IF(K31=\"\",\"\",K31/COUNTIF('Data Input'!$C$8:$AA$8,\"x\"))","v":""},{"$f":"IF(ISBLANK('Data Input'!A36),\"\",SUM('Data Input'!P36,'Data Input'!V36,'Data Input'!W36))","v":""},{"$f":"IF(M31=\"\",\"\",M31/COUNTIF('Data Input'!$C$8:$AA$8,\"÷\"))","v":""},{"$f":"IF(ISBLANK('Data Input'!A36),\"\",SUM('Data Input'!T36,'Data Input'!X36,'Data Input'!Z36,'Data Input'!AA36))","v":""},{"$f":"IF(O31=\"\",\"\",O31/COUNTIF('Data Input'!$C$8:$AA$8,\"F\"))","v":""}]
[{"$f":"IF('Data Input'!A37=0,\"\",'Data Input'!A37)","v":""},{"$f":"IF(ISBLANK('Data Input'!A37),\"\",COUNTIF('Data Input'!C37:AA37,\"\"))","v":""},{"$f":"IF(ISBLANK('Data Input'!A37),\"\",COUNTIF('Data Input'!C37:AA37,\"0\"))","v":""},{"$f":"IF(ISBLANK('Data Input'!A37),\"\",SUM(B32,C32))","v":""},{"$f":"IF(ISBLANK('Data Input'!A37),\"\",SUM('Data Input'!C37:AA37))","v":""},{"$f":"IF(E32=\"\",\"\",E32/(COUNTA('Data Input'!$C$8:$AA$8)))","v":""},{"$f":"IF(ISBLANK('Data Input'!A37),\"\",SUM('Data Input'!C37,'Data Input'!F37,'Data Input'!G37,'Data Input'!J37,'Data Input'!L37,'Data Input'!O37,'Data Input'!Q37,'Data Input'!R37,'Data Input'!U37))","v":""},{"$f":"IF(G32=\"\",\"\",G32/COUNTIF('Data Input'!$C$8:$AA$8,\"+\"))","v":""},{"$f":"IF(ISBLANK('Data Input'!A37),\"\",SUM('Data Input'!D37,'Data Input'!E37,'Data Input'!K37,'Data Input'!M37,'Data Input'!Y37))","v":""},{"$f":"IF(I32=\"\",\"\",I32/COUNTIF('Data Input'!$C$8:$AA$8,\"-\"))","v":""},{"$f":"IF(ISBLANK('Data Input'!A37),\"\",SUM('Data Input'!H37,'Data Input'!I37,'Data Input'!N37,'Data Input'!S37))","v":""},{"$f":"IF(K32=\"\",\"\",K32/COUNTIF('Data Input'!$C$8:$AA$8,\"x\"))","v":""},{"$f":"IF(ISBLANK('Data Input'!A37),\"\",SUM('Data Input'!P37,'Data Input'!V37,'Data Input'!W37))","v":""},{"$f":"IF(M32=\"\",\"\",M32/COUNTIF('Data Input'!$C$8:$AA$8,\"÷\"))","v":""},{"$f":"IF(ISBLANK('Data Input'!A37),\"\",SUM('Data Input'!T37,'Data Input'!X37,'Data Input'!Z37,'Data Input'!AA37))","v":""},{"$f":"IF(O32=\"\",\"\",O32/COUNTIF('Data Input'!$C$8:$AA$8,\"F\"))","v":""}]
[{"$f":"IF('Data Input'!A38=0,\"\",'Data Input'!A38)","v":""},{"$f":"IF(ISBLANK('Data Input'!A38),\"\",COUNTIF('Data Input'!C38:AA38,\"\"))","v":""},{"$f":"IF(ISBLANK('Data Input'!A38),\"\",COUNTIF('Data Input'!C38:AA38,\"0\"))","v":""},{"$f":"IF(ISBLANK('Data Input'!A38),\"\",SUM(B33,C33))","v":""},{"$f":"IF(ISBLANK('Data Input'!A38),\"\",SUM('Data Input'!C38:AA38))","v":""},{"$f":"IF(E33=\"\",\"\",E33/(COUNTA('Data Input'!$C$8:$AA$8)))","v":""},{"$f":"IF(ISBLANK('Data Input'!A38),\"\",SUM('Data Input'!C38,'Data Input'!F38,'Data Input'!G38,'Data Input'!J38,'Data Input'!L38,'Data Input'!O38,'Data Input'!Q38,'Data Input'!R38,'Data Input'!U38))","v":""},{"$f":"IF(G33=\"\",\"\",G33/COUNTIF('Data Input'!$C$8:$AA$8,\"+\"))","v":""},{"$f":"IF(ISBLANK('Data Input'!A38),\"\",SUM('Data Input'!D38,'Data Input'!E38,'Data Input'!K38,'Data Input'!M38,'Data Input'!Y38))","v":""},{"$f":"IF(I33=\"\",\"\",I33/COUNTIF('Data Input'!$C$8:$AA$8,\"-\"))","v":""},{"$f":"IF(ISBLANK('Data Input'!A38),\"\",SUM('Data Input'!H38,'Data Input'!I38,'Data Input'!N38,'Data Input'!S38))","v":""},{"$f":"IF(K33=\"\",\"\",K33/COUNTIF('Data Input'!$C$8:$AA$8,\"x\"))","v":""},{"$f":"IF(ISBLANK('Data Input'!A38),\"\",SUM('Data Input'!P38,'Data Input'!V38,'Data Input'!W38))","v":""},{"$f":"IF(M33=\"\",\"\",M33/COUNTIF('Data Input'!$C$8:$AA$8,\"÷\"))","v":""},{"$f":"IF(ISBLANK('Data Input'!A38),\"\",SUM('Data Input'!T38,'Data Input'!X38,'Data Input'!Z38,'Data Input'!AA38))","v":""},{"$f":"IF(O33=\"\",\"\",O33/COUNTIF('Data Input'!$C$8:$AA$8,\"F\"))","v":""}]
[{"$f":"IF('Data Input'!A39=0,\"\",'Data Input'!A39)","v":""},{"$f":"IF(ISBLANK('Data Input'!A39),\"\",COUNTIF('Data Input'!C39:AA39,\"\"))","v":""},{"$f":"IF(ISBLANK('Data Input'!A39),\"\",COUNTIF('Data Input'!C39:AA39,\"0\"))","v":""},{"$f":"IF(ISBLANK('Data Input'!A39),\"\",SUM(B34,C34))","v":""},{"$f":"IF(ISBLANK('Data Input'!A39),\"\",SUM('Data Input'!C39:AA39))","v":""},{"$f":"IF(E34=\"\",\"\",E34/(COUNTA('Data Input'!$C$8:$AA$8)))","v":""},{"$f":"IF(ISBLANK('Data Input'!A39),\"\",SUM('Data Input'!C39,'Data Input'!F39,'Data Input'!G39,'Data Input'!J39,'Data Input'!L39,'Data Input'!O39,'Data Input'!Q39,'Data Input'!R39,'Data Input'!U39))","v":""},{"$f":"IF(G34=\"\",\"\",G34/COUNTIF('Data Input'!$C$8:$AA$8,\"+\"))","v":""},{"$f":"IF(ISBLANK('Data Input'!A39),\"\",SUM('Data Input'!D39,'Data Input'!E39,'Data Input'!K39,'Data Input'!M39,'Data Input'!Y39))","v":""},{"$f":"IF(I34=\"\",\"\",I34/COUNTIF('Data Input'!$C$8:$AA$8,\"-\"))","v":""},{"$f":"IF(ISBLANK('Data Input'!A39),\"\",SUM('Data Input'!H39,'Data Input'!I39,'Data Input'!N39,'Data Input'!S39))","v":""},{"$f":"IF(K34=\"\",\"\",K34/COUNTIF('Data Input'!$C$8:$AA$8,\"x\"))","v":""},{"$f":"IF(ISBLANK('Data Input'!A39),\"\",SUM('Data Input'!P39,'Data Input'!V39,'Data Input'!W39))","v":""},{"$f":"IF(M34=\"\",\"\",M34/COUNTIF('Data Input'!$C$8:$AA$8,\"÷\"))","v":""},{"$f":"IF(ISBLANK('Data Input'!A39),\"\",SUM('Data Input'!T39,'Data Input'!X39,'Data Input'!Z39,'Data Input'!AA39))","v":""},{"$f":"IF(O34=\"\",\"\",O34/COUNTIF('Data Input'!$C$8:$AA$8,\"F\"))","v":""}]
[{"$f":"IF('Data Input'!A40=0,\"\",'Data Input'!A40)","v":""},{"$f":"IF(ISBLANK('Data Input'!A40),\"\",COUNTIF('Data Input'!C40:AA40,\"\"))","v":""},{"$f":"IF(ISBLANK('Data Input'!A40),\"\",COUNTIF('Data Input'!C40:AA40,\"0\"))","v":""},{"$f":"IF(ISBLANK('Data Input'!A40),\"\",SUM(B35,C35))","v":""},{"$f":"IF(ISBLANK('Data Input'!A40),\"\",SUM('Data Input'!C40:AA40))","v":""},{"$f":"IF(E35=\"\",\"\",E35/(COUNTA('Data Input'!$C$8:$AA$8)))","v":""},{"$f":"IF(ISBLANK('Data Input'!A40),\"\",SUM('Data Input'!C40,'Data Input'!F40,'Data Input'!G40,'Data Input'!J40,'Data Input'!L40,'Data Input'!O40,'Data Input'!Q40,'Data Input'!R40,'Data Input'!U40))","v":""},{"$f":"IF(G35=\"\",\"\",G35/COUNTIF('Data Input'!$C$8:$AA$8,\"+\"))","v":""},{"$f":"IF(ISBLANK('Data Input'!A40),\"\",SUM('Data Input'!D40,'Data Input'!E40,'Data Input'!K40,'Data Input'!M40,'Data Input'!Y40))","v":""},{"$f":"IF(I35=\"\",\"\",I35/COUNTIF('Data Input'!$C$8:$AA$8,\"-\"))","v":""},{"$f":"IF(ISBLANK('Data Input'!A40),\"\",SUM('Data Input'!H40,'Data Input'!I40,'Data Input'!N40,'Data Input'!S40))","v":""},{"$f":"IF(K35=\"\",\"\",K35/COUNTIF('Data Input'!$C$8:$AA$8,\"x\"))","v":""},{"$f":"IF(ISBLANK('Data Input'!A40),\"\",SUM('Data Input'!P40,'Data Input'!V40,'Data Input'!W40))","v":""},{"$f":"IF(M35=\"\",\"\",M35/COUNTIF('Data Input'!$C$8:$AA$8,\"÷\"))","v":""},{"$f":"IF(ISBLANK('Data Input'!A40),\"\",SUM('Data Input'!T40,'Data Input'!X40,'Data Input'!Z40,'Data Input'!AA40))","v":""},{"$f":"IF(O35=\"\",\"\",O35/COUNTIF('Data Input'!$C$8:$AA$8,\"F\"))","v":""}]
[{"$f":"IF('Data Input'!A41=0,\"\",'Data Input'!A41)","v":""},{"$f":"IF(ISBLANK('Data Input'!A41),\"\",COUNTIF('Data Input'!C41:AA41,\"\"))","v":""},{"$f":"IF(ISBLANK('Data Input'!A41),\"\",COUNTIF('Data Input'!C41:AA41,\"0\"))","v":""},{"$f":"IF(ISBLANK('Data Input'!A41),\"\",SUM(B36,C36))","v":""},{"$f":"IF(ISBLANK('Data Input'!A41),\"\",SUM('Data Input'!C41:AA41))","v":""},{"$f":"IF(E36=\"\",\"\",E36/(COUNTA('Data Input'!$C$8:$AA$8)))","v":""},{"$f":"IF(ISBLANK('Data Input'!A41),\"\",SUM('Data Input'!C41,'Data Input'!F41,'Data Input'!G41,'Data Input'!J41,'Data Input'!L41,'Data Input'!O41,'Data Input'!Q41,'Data Input'!R41,'Data Input'!U41))","v":""},{"$f":"IF(G36=\"\",\"\",G36/COUNTIF('Data Input'!$C$8:$AA$8,\"+\"))","v":""},{"$f":"IF(ISBLANK('Data Input'!A41),\"\",SUM('Data Input'!D41,'Data Input'!E41,'Data Input'!K41,'Data Input'!M41,'Data Input'!Y41))","v":""},{"$f":"IF(I36=\"\",\"\",I36/COUNTIF('Data Input'!$C$8:$AA$8,\"-\"))","v":""},{"$f":"IF(ISBLANK('Data Input'!A41),\"\",SUM('Data Input'!H41,'Data Input'!I41,'Data Input'!N41,'Data Input'!S41))","v":""},{"$f":"IF(K36=\"\",\"\",K36/COUNTIF('Data Input'!$C$8:$AA$8,\"x\"))","v":""},{"$f":"IF(ISBLANK('Data Input'!A41),\"\",SUM('Data Input'!P41,'Data Input'!V41,'Data Input'!W41))","v":""},{"$f":"IF(M36=\"\",\"\",M36/COUNTIF('Data Input'!$C$8:$AA$8,\"÷\"))","v":""},{"$f":"IF(ISBLANK('Data Input'!A41),\"\",SUM('Data Input'!T41,'Data Input'!X41,'Data Input'!Z41,'Data Input'!AA41))","v":""},{"$f":"IF(O36=\"\",\"\",O36/COUNTIF('Data Input'!$C$8:$AA$8,\"F\"))","v":""}]
[{"$f":"IF('Data Input'!A42=0,\"\",'Data Input'!A42)","v":""},{"$f":"IF(ISBLANK('Data Input'!A42),\"\",COUNTIF('Data Input'!C42:AA42,\"\"))","v":""},{"$f":"IF(ISBLANK('Data Input'!A42),\"\",COUNTIF('Data Input'!C42:AA42,\"0\"))","v":""},{"$f":"IF(ISBLANK('Data Input'!A42),\"\",SUM(B37,C37))","v":""},{"$f":"IF(ISBLANK('Data Input'!A42),\"\",SUM('Data Input'!C42:AA42))","v":""},{"$f":"IF(E37=\"\",\"\",E37/(COUNTA('Data Input'!$C$8:$AA$8)))","v":""},{"$f":"IF(ISBLANK('Data Input'!A42),\"\",SUM('Data Input'!C42,'Data Input'!F42,'Data Input'!G42,'Data Input'!J42,'Data Input'!L42,'Data Input'!O42,'Data Input'!Q42,'Data Input'!R42,'Data Input'!U42))","v":""},{"$f":"IF(G37=\"\",\"\",G37/COUNTIF('Data Input'!$C$8:$AA$8,\"+\"))","v":""},{"$f":"IF(ISBLANK('Data Input'!A42),\"\",SUM('Data Input'!D42,'Data Input'!E42,'Data Input'!K42,'Data Input'!M42,'Data Input'!Y42))","v":""},{"$f":"IF(I37=\"\",\"\",I37/COUNTIF('Data Input'!$C$8:$AA$8,\"-\"))","v":""},{"$f":"IF(ISBLANK('Data Input'!A42),\"\",SUM('Data Input'!H42,'Data Input'!I42,'Data Input'!N42,'Data Input'!S42))","v":""},{"$f":"IF(K37=\"\",\"\",K37/COUNTIF('Data Input'!$C$8:$AA$8,\"x\"))","v":""},{"$f":"IF(ISBLANK('Data Input'!A42),\"\",SUM('Data Input'!P42,'Data Input'!V42,'Data Input'!W42))","v":""},{"$f":"IF(M37=\"\",\"\",M37/COUNTIF('Data Input'!$C$8:$AA$8,\"÷\"))","v":""},{"$f":"IF(ISBLANK('Data Input'!A42),\"\",SUM('Data Input'!T42,'Data Input'!X42,'Data Input'!Z42,'Data Input'!AA42))","v":""},{"$f":"IF(O37=\"\",\"\",O37/COUNTIF('Data Input'!$C$8:$AA$8,\"F\"))","v":""}]
[{"$f":"IF('Data Input'!A43=0,\"\",'Data Input'!A43)","v":""},{"$f":"IF(ISBLANK('Data Input'!A43),\"\",COUNTIF('Data Input'!C43:AA43,\"\"))","v":""},{"$f":"IF(ISBLANK('Data Input'!A43),\"\",COUNTIF('Data Input'!C43:AA43,\"0\"))","v":""},{"$f":"IF(ISBLANK('Data Input'!A43),\"\",SUM(B38,C38))","v":""},{"$f":"IF(ISBLANK('Data Input'!A43),\"\",SUM('Data Input'!C43:AA43))","v":""},{"$f":"IF(E38=\"\",\"\",E38/(COUNTA('Data Input'!$C$8:$AA$8)))","v":""},{"$f":"IF(ISBLANK('Data Input'!A43),\"\",SUM('Data Input'!C43,'Data Input'!F43,'Data Input'!G43,'Data Input'!J43,'Data Input'!L43,'Data Input'!O43,'Data Input'!Q43,'Data Input'!R43,'Data Input'!U43))","v":""},{"$f":"IF(G38=\"\",\"\",G38/COUNTIF('Data Input'!$C$8:$AA$8,\"+\"))","v":""},{"$f":"IF(ISBLANK('Data Input'!A43),\"\",SUM('Data Input'!D43,'Data Input'!E43,'Data Input'!K43,'Data Input'!M43,'Data Input'!Y43))","v":""},{"$f":"IF(I38=\"\",\"\",I38/COUNTIF('Data Input'!$C$8:$AA$8,\"-\"))","v":""},{"$f":"IF(ISBLANK('Data Input'!A43),\"\",SUM('Data Input'!H43,'Data Input'!I43,'Data Input'!N43,'Data Input'!S43))","v":""},{"$f":"IF(K38=\"\",\"\",K38/COUNTIF('Data Input'!$C$8:$AA$8,\"x\"))","v":""},{"$f":"IF(ISBLANK('Data Input'!A43),\"\",SUM('Data Input'!P43,'Data Input'!V43,'Data Input'!W43))","v":""},{"$f":"IF(M38=\"\",\"\",M38/COUNTIF('Data Input'!$C$8:$AA$8,\"÷\"))","v":""},{"$f":"IF(ISBLANK('Data Input'!A43),\"\",SUM('Data Input'!T43,'Data Input'!X43,'Data Input'!Z43,'Data Input'!AA43))","v":""},{"$f":"IF(O38=\"\",\"\",O38/COUNTIF('Data Input'!$C$8:$AA$8,\"F\"))","v":""}]
[{"$f":"IF('Data Input'!A44=0,\"\",'Data Input'!A44)","v":""},{"$f":"IF(ISBLANK('Data Input'!A44),\"\",COUNTIF('Data Input'!C44:AA44,\"\"))","v":""},{"$f":"IF(ISBLANK('Data Input'!A44),\"\",COUNTIF('Data Input'!C44:AA44,\"0\"))","v":""},{"$f":"IF(ISBLANK('Data Input'!A44),\"\",SUM(B39,C39))","v":""},{"$f":"IF(ISBLANK('Data Input'!A44),\"\",SUM('Data Input'!C44:AA44))","v":""},{"$f":"IF(E39=\"\",\"\",E39/(COUNTA('Data Input'!$C$8:$AA$8)))","v":""},{"$f":"IF(ISBLANK('Data Input'!A44),\"\",SUM('Data Input'!C44,'Data Input'!F44,'Data Input'!G44,'Data Input'!J44,'Data Input'!L44,'Data Input'!O44,'Data Input'!Q44,'Data Input'!R44,'Data Input'!U44))","v":""},{"$f":"IF(G39=\"\",\"\",G39/COUNTIF('Data Input'!$C$8:$AA$8,\"+\"))","v":""},{"$f":"IF(ISBLANK('Data Input'!A44),\"\",SUM('Data Input'!D44,'Data Input'!E44,'Data Input'!K44,'Data Input'!M44,'Data Input'!Y44))","v":""},{"$f":"IF(I39=\"\",\"\",I39/COUNTIF('Data Input'!$C$8:$AA$8,\"-\"))","v":""},{"$f":"IF(ISBLANK('Data Input'!A44),\"\",SUM('Data Input'!H44,'Data Input'!I44,'Data Input'!N44,'Data Input'!S44))","v":""},{"$f":"IF(K39=\"\",\"\",K39/COUNTIF('Data Input'!$C$8:$AA$8,\"x\"))","v":""},{"$f":"IF(ISBLANK('Data Input'!A44),\"\",SUM('Data Input'!P44,'Data Input'!V44,'Data Input'!W44))","v":""},{"$f":"IF(M39=\"\",\"\",M39/COUNTIF('Data Input'!$C$8:$AA$8,\"÷\"))","v":""},{"$f":"IF(ISBLANK('Data Input'!A44),\"\",SUM('Data Input'!T44,'Data Input'!X44,'Data Input'!Z44,'Data Input'!AA44))","v":""},{"$f":"IF(O39=\"\",\"\",O39/COUNTIF('Data Input'!$C$8:$AA$8,\"F\"))","v":""}]
[{"$f":"IF('Data Input'!A45=0,\"\",'Data Input'!A45)","v":""},{"$f":"IF(ISBLANK('Data Input'!A45),\"\",COUNTIF('Data Input'!C45:AA45,\"\"))","v":""},{"$f":"IF(ISBLANK('Data Input'!A45),\"\",COUNTIF('Data Input'!C45:AA45,\"0\"))","v":""},{"$f":"IF(ISBLANK('Data Input'!A45),\"\",SUM(B40,C40))","v":""},{"$f":"IF(ISBLANK('Data Input'!A45),\"\",SUM('Data Input'!C45:AA45))","v":""},{"$f":"IF(E40=\"\",\"\",E40/(COUNTA('Data Input'!$C$8:$AA$8)))","v":""},{"$f":"IF(ISBLANK('Data Input'!A45),\"\",SUM('Data Input'!C45,'Data Input'!F45,'Data Input'!G45,'Data Input'!J45,'Data Input'!L45,'Data Input'!O45,'Data Input'!Q45,'Data Input'!R45,'Data Input'!U45))","v":""},{"$f":"IF(G40=\"\",\"\",G40/COUNTIF('Data Input'!$C$8:$AA$8,\"+\"))","v":""},{"$f":"IF(ISBLANK('Data Input'!A45),\"\",SUM('Data Input'!D45,'Data Input'!E45,'Data Input'!K45,'Data Input'!M45,'Data Input'!Y45))","v":""},{"$f":"IF(I40=\"\",\"\",I40/COUNTIF('Data Input'!$C$8:$AA$8,\"-\"))","v":""},{"$f":"IF(ISBLANK('Data Input'!A45),\"\",SUM('Data Input'!H45,'Data Input'!I45,'Data Input'!N45,'Data Input'!S45))","v":""},{"$f":"IF(K40=\"\",\"\",K40/COUNTIF('Data Input'!$C$8:$AA$8,\"x\"))","v":""},{"$f":"IF(ISBLANK('Data Input'!A45),\"\",SUM('Data Input'!P45,'Data Input'!V45,'Data Input'!W45))","v":""},{"$f":"IF(M40=\"\",\"\",M40/COUNTIF('Data Input'!$C$8:$AA$8,\"÷\"))","v":""},{"$f":"IF(ISBLANK('Data Input'!A45),\"\",SUM('Data Input'!T45,'Data Input'!X45,'Data Input'!Z45,'Data Input'!AA45))","v":""},{"$f":"IF(O40=\"\",\"\",O40/COUNTIF('Data Input'!$C$8:$AA$8,\"F\"))","v":""}]
[{"$f":"IF('Data Input'!A46=0,\"\",'Data Input'!A46)","v":""},{"$f":"IF(ISBLANK('Data Input'!A46),\"\",COUNTIF('Data Input'!C46:AA46,\"\"))","v":""},{"$f":"IF(ISBLANK('Data Input'!A46),\"\",COUNTIF('Data Input'!C46:AA46,\"0\"))","v":""},{"$f":"IF(ISBLANK('Data Input'!A46),\"\",SUM(B41,C41))","v":""},{"$f":"IF(ISBLANK('Data Input'!A46),\"\",SUM('Data Input'!C46:AA46))","v":""},{"$f":"IF(E41=\"\",\"\",E41/(COUNTA('Data Input'!$C$8:$AA$8)))","v":""},{"$f":"IF(ISBLANK('Data Input'!A46),\"\",SUM('Data Input'!C46,'Data Input'!F46,'Data Input'!G46,'Data Input'!J46,'Data Input'!L46,'Data Input'!O46,'Data Input'!Q46,'Data Input'!R46,'Data Input'!U46))","v":""},{"$f":"IF(G41=\"\",\"\",G41/COUNTIF('Data Input'!$C$8:$AA$8,\"+\"))","v":""},{"$f":"IF(ISBLANK('Data Input'!A46),\"\",SUM('Data Input'!D46,'Data Input'!E46,'Data Input'!K46,'Data Input'!M46,'Data Input'!Y46))","v":""},{"$f":"IF(I41=\"\",\"\",I41/COUNTIF('Data Input'!$C$8:$AA$8,\"-\"))","v":""},{"$f":"IF(ISBLANK('Data Input'!A46),\"\",SUM('Data Input'!H46,'Data Input'!I46,'Data Input'!N46,'Data Input'!S46))","v":""},{"$f":"IF(K41=\"\",\"\",K41/COUNTIF('Data Input'!$C$8:$AA$8,\"x\"))","v":""},{"$f":"IF(ISBLANK('Data Input'!A46),\"\",SUM('Data Input'!P46,'Data Input'!V46,'Data Input'!W46))","v":""},{"$f":"IF(M41=\"\",\"\",M41/COUNTIF('Data Input'!$C$8:$AA$8,\"÷\"))","v":""},{"$f":"IF(ISBLANK('Data Input'!A46),\"\",SUM('Data Input'!T46,'Data Input'!X46,'Data Input'!Z46,'Data Input'!AA46))","v":""},{"$f":"IF(O41=\"\",\"\",O41/COUNTIF('Data Input'!$C$8:$AA$8,\"F\"))","v":""}]
[{"$f":"IF('Data Input'!A47=0,\"\",'Data Input'!A47)","v":""},{"$f":"IF(ISBLANK('Data Input'!A47),\"\",COUNTIF('Data Input'!C47:AA47,\"\"))","v":""},{"$f":"IF(ISBLANK('Data Input'!A47),\"\",COUNTIF('Data Input'!C47:AA47,\"0\"))","v":""},{"$f":"IF(ISBLANK('Data Input'!A47),\"\",SUM(B42,C42))","v":""},{"$f":"IF(ISBLANK('Data Input'!A47),\"\",SUM('Data Input'!C47:AA47))","v":""},{"$f":"IF(E42=\"\",\"\",E42/(COUNTA('Data Input'!$C$8:$AA$8)))","v":""},{"$f":"IF(ISBLANK('Data Input'!A47),\"\",SUM('Data Input'!C47,'Data Input'!F47,'Data Input'!G47,'Data Input'!J47,'Data Input'!L47,'Data Input'!O47,'Data Input'!Q47,'Data Input'!R47,'Data Input'!U47))","v":""},{"$f":"IF(G42=\"\",\"\",G42/COUNTIF('Data Input'!$C$8:$AA$8,\"+\"))","v":""},{"$f":"IF(ISBLANK('Data Input'!A47),\"\",SUM('Data Input'!D47,'Data Input'!E47,'Data Input'!K47,'Data Input'!M47,'Data Input'!Y47))","v":""},{"$f":"IF(I42=\"\",\"\",I42/COUNTIF('Data Input'!$C$8:$AA$8,\"-\"))","v":""},{"$f":"IF(ISBLANK('Data Input'!A47),\"\",SUM('Data Input'!H47,'Data Input'!I47,'Data Input'!N47,'Data Input'!S47))","v":""},{"$f":"IF(K42=\"\",\"\",K42/COUNTIF('Data Input'!$C$8:$AA$8,\"x\"))","v":""},{"$f":"IF(ISBLANK('Data Input'!A47),\"\",SUM('Data Input'!P47,'Data Input'!V47,'Data Input'!W47))","v":""},{"$f":"IF(M42=\"\",\"\",M42/COUNTIF('Data Input'!$C$8:$AA$8,\"÷\"))","v":""},{"$f":"IF(ISBLANK('Data Input'!A47),\"\",SUM('Data Input'!T47,'Data Input'!X47,'Data Input'!Z47,'Data Input'!AA47))","v":""},{"$f":"IF(O42=\"\",\"\",O42/COUNTIF('Data Input'!$C$8:$AA$8,\"F\"))","v":""}]
[{"$f":"IF('Data Input'!A48=0,\"\",'Data Input'!A48)","v":""},{"$f":"IF(ISBLANK('Data Input'!A48),\"\",COUNTIF('Data Input'!C48:AA48,\"\"))","v":""},{"$f":"IF(ISBLANK('Data Input'!A48),\"\",COUNTIF('Data Input'!C48:AA48,\"0\"))","v":""},{"$f":"IF(ISBLANK('Data Input'!A48),\"\",SUM(B43,C43))","v":""},{"$f":"IF(ISBLANK('Data Input'!A48),\"\",SUM('Data Input'!C48:AA48))","v":""},{"$f":"IF(E43=\"\",\"\",E43/(COUNTA('Data Input'!$C$8:$AA$8)))","v":""},{"$f":"IF(ISBLANK('Data Input'!A48),\"\",SUM('Data Input'!C48,'Data Input'!F48,'Data Input'!G48,'Data Input'!J48,'Data Input'!L48,'Data Input'!O48,'Data Input'!Q48,'Data Input'!R48,'Data Input'!U48))","v":""},{"$f":"IF(G43=\"\",\"\",G43/COUNTIF('Data Input'!$C$8:$AA$8,\"+\"))","v":""},{"$f":"IF(ISBLANK('Data Input'!A48),\"\",SUM('Data Input'!D48,'Data Input'!E48,'Data Input'!K48,'Data Input'!M48,'Data Input'!Y48))","v":""},{"$f":"IF(I43=\"\",\"\",I43/COUNTIF('Data Input'!$C$8:$AA$8,\"-\"))","v":""},{"$f":"IF(ISBLANK('Data Input'!A48),\"\",SUM('Data Input'!H48,'Data Input'!I48,'Data Input'!N48,'Data Input'!S48))","v":""},{"$f":"IF(K43=\"\",\"\",K43/COUNTIF('Data Input'!$C$8:$AA$8,\"x\"))","v":""},{"$f":"IF(ISBLANK('Data Input'!A48),\"\",SUM('Data Input'!P48,'Data Input'!V48,'Data Input'!W48))","v":""},{"$f":"IF(M43=\"\",\"\",M43/COUNTIF('Data Input'!$C$8:$AA$8,\"÷\"))","v":""},{"$f":"IF(ISBLANK('Data Input'!A48),\"\",SUM('Data Input'!T48,'Data Input'!X48,'Data Input'!Z48,'Data Input'!AA48))","v":""},{"$f":"IF(O43=\"\",\"\",O43/COUNTIF('Data Input'!$C$8:$AA$8,\"F\"))","v":""}]
[{"$f":"IF('Data Input'!A49=0,\"\",'Data Input'!A49)","v":""},{"$f":"IF(ISBLANK('Data Input'!A49),\"\",COUNTIF('Data Input'!C49:AA49,\"\"))","v":""},{"$f":"IF(ISBLANK('Data Input'!A49),\"\",COUNTIF('Data Input'!C49:AA49,\"0\"))","v":""},{"$f":"IF(ISBLANK('Data Input'!A49),\"\",SUM(B44,C44))","v":""},{"$f":"IF(ISBLANK('Data Input'!A49),\"\",SUM('Data Input'!C49:AA49))","v":""},{"$f":"IF(E44=\"\",\"\",E44/(COUNTA('Data Input'!$C$8:$AA$8)))","v":""},{"$f":"IF(ISBLANK('Data Input'!A49),\"\",SUM('Data Input'!C49,'Data Input'!F49,'Data Input'!G49,'Data Input'!J49,'Data Input'!L49,'Data Input'!O49,'Data Input'!Q49,'Data Input'!R49,'Data Input'!U49))","v":""},{"$f":"IF(G44=\"\",\"\",G44/COUNTIF('Data Input'!$C$8:$AA$8,\"+\"))","v":""},{"$f":"IF(ISBLANK('Data Input'!A49),\"\",SUM('Data Input'!D49,'Data Input'!E49,'Data Input'!K49,'Data Input'!M49,'Data Input'!Y49))","v":""},{"$f":"IF(I44=\"\",\"\",I44/COUNTIF('Data Input'!$C$8:$AA$8,\"-\"))","v":""},{"$f":"IF(ISBLANK('Data Input'!A49),\"\",SUM('Data Input'!H49,'Data Input'!I49,'Data Input'!N49,'Data Input'!S49))","v":""},{"$f":"IF(K44=\"\",\"\",K44/COUNTIF('Data Input'!$C$8:$AA$8,\"x\"))","v":""},{"$f":"IF(ISBLANK('Data Input'!A49),\"\",SUM('Data Input'!P49,'Data Input'!V49,'Data Input'!W49))","v":""},{"$f":"IF(M44=\"\",\"\",M44/COUNTIF('Data Input'!$C$8:$AA$8,\"÷\"))","v":""},{"$f":"IF(ISBLANK('Data Input'!A49),\"\",SUM('Data Input'!T49,'Data Input'!X49,'Data Input'!Z49,'Data Input'!AA49))","v":""},{"$f":"IF(O44=\"\",\"\",O44/COUNTIF('Data Input'!$C$8:$AA$8,\"F\"))","v":""}]
[{"$f":"IF('Data Input'!A50=0,\"\",'Data Input'!A50)","v":""},{"$f":"IF(ISBLANK('Data Input'!A50),\"\",COUNTIF('Data Input'!C50:AA50,\"\"))","v":""},{"$f":"IF(ISBLANK('Data Input'!A50),\"\",COUNTIF('Data Input'!C50:AA50,\"0\"))","v":""},{"$f":"IF(ISBLANK('Data Input'!A50),\"\",SUM(B45,C45))","v":""},{"$f":"IF(ISBLANK('Data Input'!A50),\"\",SUM('Data Input'!C50:AA50))","v":""},{"$f":"IF(E45=\"\",\"\",E45/(COUNTA('Data Input'!$C$8:$AA$8)))","v":""},{"$f":"IF(ISBLANK('Data Input'!A50),\"\",SUM('Data Input'!C50,'Data Input'!F50,'Data Input'!G50,'Data Input'!J50,'Data Input'!L50,'Data Input'!O50,'Data Input'!Q50,'Data Input'!R50,'Data Input'!U50))","v":""},{"$f":"IF(G45=\"\",\"\",G45/COUNTIF('Data Input'!$C$8:$AA$8,\"+\"))","v":""},{"$f":"IF(ISBLANK('Data Input'!A50),\"\",SUM('Data Input'!D50,'Data Input'!E50,'Data Input'!K50,'Data Input'!M50,'Data Input'!Y50))","v":""},{"$f":"IF(I45=\"\",\"\",I45/COUNTIF('Data Input'!$C$8:$AA$8,\"-\"))","v":""},{"$f":"IF(ISBLANK('Data Input'!A50),\"\",SUM('Data Input'!H50,'Data Input'!I50,'Data Input'!N50,'Data Input'!S50))","v":""},{"$f":"IF(K45=\"\",\"\",K45/COUNTIF('Data Input'!$C$8:$AA$8,\"x\"))","v":""},{"$f":"IF(ISBLANK('Data Input'!A50),\"\",SUM('Data Input'!P50,'Data Input'!V50,'Data Input'!W50))","v":""},{"$f":"IF(M45=\"\",\"\",M45/COUNTIF('Data Input'!$C$8:$AA$8,\"÷\"))","v":""},{"$f":"IF(ISBLANK('Data Input'!A50),\"\",SUM('Data Input'!T50,'Data Input'!X50,'Data Input'!Z50,'Data Input'!AA50))","v":""},{"$f":"IF(O45=\"\",\"\",O45/COUNTIF('Data Input'!$C$8:$AA$8,\"F\"))","v":""}]
[{"$f":"IF('Data Input'!A51=0,\"\",'Data Input'!A51)","v":""},{"$f":"IF(ISBLANK('Data Input'!A51),\"\",COUNTIF('Data Input'!C51:AA51,\"\"))","v":""},{"$f":"IF(ISBLANK('Data Input'!A51),\"\",COUNTIF('Data Input'!C51:AA51,\"0\"))","v":""},{"$f":"IF(ISBLANK('Data Input'!A51),\"\",SUM(B46,C46))","v":""},{"$f":"IF(ISBLANK('Data Input'!A51),\"\",SUM('Data Input'!C51:AA51))","v":""},{"$f":"IF(E46=\"\",\"\",E46/(COUNTA('Data Input'!$C$8:$AA$8)))","v":""},{"$f":"IF(ISBLANK('Data Input'!A51),\"\",SUM('Data Input'!C51,'Data Input'!F51,'Data Input'!G51,'Data Input'!J51,'Data Input'!L51,'Data Input'!O51,'Data Input'!Q51,'Data Input'!R51,'Data Input'!U51))","v":""},{"$f":"IF(G46=\"\",\"\",G46/COUNTIF('Data Input'!$C$8:$AA$8,\"+\"))","v":""},{"$f":"IF(ISBLANK('Data Input'!A51),\"\",SUM('Data Input'!D51,'Data Input'!E51,'Data Input'!K51,'Data Input'!M51,'Data Input'!Y51))","v":""},{"$f":"IF(I46=\"\",\"\",I46/COUNTIF('Data Input'!$C$8:$AA$8,\"-\"))","v":""},{"$f":"IF(ISBLANK('Data Input'!A51),\"\",SUM('Data Input'!H51,'Data Input'!I51,'Data Input'!N51,'Data Input'!S51))","v":""},{"$f":"IF(K46=\"\",\"\",K46/COUNTIF('Data Input'!$C$8:$AA$8,\"x\"))","v":""},{"$f":"IF(ISBLANK('Data Input'!A51),\"\",SUM('Data Input'!P51,'Data Input'!V51,'Data Input'!W51))","v":""},{"$f":"IF(M46=\"\",\"\",M46/COUNTIF('Data Input'!$C$8:$AA$8,\"÷\"))","v":""},{"$f":"IF(ISBLANK('Data Input'!A51),\"\",SUM('Data Input'!T51,'Data Input'!X51,'Data Input'!Z51,'Data Input'!AA51))","v":""},{"$f":"IF(O46=\"\",\"\",O46/COUNTIF('Data Input'!$C$8:$AA$8,\"F\"))","v":""}]
[{"$f":"IF('Data Input'!A52=0,\"\",'Data Input'!A52)","v":""},{"$f":"IF(ISBLANK('Data Input'!A52),\"\",COUNTIF('Data Input'!C52:AA52,\"\"))","v":""},{"$f":"IF(ISBLANK('Data Input'!A52),\"\",COUNTIF('Data Input'!C52:AA52,\"0\"))","v":""},{"$f":"IF(ISBLANK('Data Input'!A52),\"\",SUM(B47,C47))","v":""},{"$f":"IF(ISBLANK('Data Input'!A52),\"\",SUM('Data Input'!C52:AA52))","v":""},{"$f":"IF(E47=\"\",\"\",E47/(COUNTA('Data Input'!$C$8:$AA$8)))","v":""},{"$f":"IF(ISBLANK('Data Input'!A52),\"\",SUM('Data Input'!C52,'Data Input'!F52,'Data Input'!G52,'Data Input'!J52,'Data Input'!L52,'Data Input'!O52,'Data Input'!Q52,'Data Input'!R52,'Data Input'!U52))","v":""},{"$f":"IF(G47=\"\",\"\",G47/COUNTIF('Data Input'!$C$8:$AA$8,\"+\"))","v":""},{"$f":"IF(ISBLANK('Data Input'!A52),\"\",SUM('Data Input'!D52,'Data Input'!E52,'Data Input'!K52,'Data Input'!M52,'Data Input'!Y52))","v":""},{"$f":"IF(I47=\"\",\"\",I47/COUNTIF('Data Input'!$C$8:$AA$8,\"-\"))","v":""},{"$f":"IF(ISBLANK('Data Input'!A52),\"\",SUM('Data Input'!H52,'Data Input'!I52,'Data Input'!N52,'Data Input'!S52))","v":""},{"$f":"IF(K47=\"\",\"\",K47/COUNTIF('Data Input'!$C$8:$AA$8,\"x\"))","v":""},{"$f":"IF(ISBLANK('Data Input'!A52),\"\",SUM('Data Input'!P52,'Data Input'!V52,'Data Input'!W52))","v":""},{"$f":"IF(M47=\"\",\"\",M47/COUNTIF('Data Input'!$C$8:$AA$8,\"÷\"))","v":""},{"$f":"IF(ISBLANK('Data Input'!A52),\"\",SUM('Data Input'!T52,'Data Input'!X52,'Data Input'!Z52,'Data Input'!AA52))","v":""},{"$f":"IF(O47=\"\",\"\",O47/COUNTIF('Data Input'!$C$8:$AA$8,\"F\"))","v":""}]
[{"$f":"IF('Data Input'!A53=0,\"\",'Data Input'!A53)","v":""},{"$f":"IF(ISBLANK('Data Input'!A53),\"\",COUNTIF('Data Input'!C53:AA53,\"\"))","v":""},{"$f":"IF(ISBLANK('Data Input'!A53),\"\",COUNTIF('Data Input'!C53:AA53,\"0\"))","v":""},{"$f":"IF(ISBLANK('Data Input'!A53),\"\",SUM(B48,C48))","v":""},{"$f":"IF(ISBLANK('Data Input'!A53),\"\",SUM('Data Input'!C53:AA53))","v":""},{"$f":"IF(E48=\"\",\"\",E48/(COUNTA('Data Input'!$C$8:$AA$8)))","v":""},{"$f":"IF(ISBLANK('Data Input'!A53),\"\",SUM('Data Input'!C53,'Data Input'!F53,'Data Input'!G53,'Data Input'!J53,'Data Input'!L53,'Data Input'!O53,'Data Input'!Q53,'Data Input'!R53,'Data Input'!U53))","v":""},{"$f":"IF(G48=\"\",\"\",G48/COUNTIF('Data Input'!$C$8:$AA$8,\"+\"))","v":""},{"$f":"IF(ISBLANK('Data Input'!A53),\"\",SUM('Data Input'!D53,'Data Input'!E53,'Data Input'!K53,'Data Input'!M53,'Data Input'!Y53))","v":""},{"$f":"IF(I48=\"\",\"\",I48/COUNTIF('Data Input'!$C$8:$AA$8,\"-\"))","v":""},{"$f":"IF(ISBLANK('Data Input'!A53),\"\",SUM('Data Input'!H53,'Data Input'!I53,'Data Input'!N53,'Data Input'!S53))","v":""},{"$f":"IF(K48=\"\",\"\",K48/COUNTIF('Data Input'!$C$8:$AA$8,\"x\"))","v":""},{"$f":"IF(ISBLANK('Data Input'!A53),\"\",SUM('Data Input'!P53,'Data Input'!V53,'Data Input'!W53))","v":""},{"$f":"IF(M48=\"\",\"\",M48/COUNTIF('Data Input'!$C$8:$AA$8,\"÷\"))","v":""},{"$f":"IF(ISBLANK('Data Input'!A53),\"\",SUM('Data Input'!T53,'Data Input'!X53,'Data Input'!Z53,'Data Input'!AA53))","v":""},{"$f":"IF(O48=\"\",\"\",O48/COUNTIF('Data Input'!$C$8:$AA$8,\"F\"))","v":""}]
[{"$f":"IF('Data Input'!A54=0,\"\",'Data Input'!A54)","v":""},{"$f":"IF(ISBLANK('Data Input'!A54),\"\",COUNTIF('Data Input'!C54:AA54,\"\"))","v":""},{"$f":"IF(ISBLANK('Data Input'!A54),\"\",COUNTIF('Data Input'!C54:AA54,\"0\"))","v":""},{"$f":"IF(ISBLANK('Data Input'!A54),\"\",SUM(B49,C49))","v":""},{"$f":"IF(ISBLANK('Data Input'!A54),\"\",SUM('Data Input'!C54:AA54))","v":""},{"$f":"IF(E49=\"\",\"\",E49/(COUNTA('Data Input'!$C$8:$AA$8)))","v":""},{"$f":"IF(ISBLANK('Data Input'!A54),\"\",SUM('Data Input'!C54,'Data Input'!F54,'Data Input'!G54,'Data Input'!J54,'Data Input'!L54,'Data Input'!O54,'Data Input'!Q54,'Data Input'!R54,'Data Input'!U54))","v":""},{"$f":"IF(G49=\"\",\"\",G49/COUNTIF('Data Input'!$C$8:$AA$8,\"+\"))","v":""},{"$f":"IF(ISBLANK('Data Input'!A54),\"\",SUM('Data Input'!D54,'Data Input'!E54,'Data Input'!K54,'Data Input'!M54,'Data Input'!Y54))","v":""},{"$f":"IF(I49=\"\",\"\",I49/COUNTIF('Data Input'!$C$8:$AA$8,\"-\"))","v":""},{"$f":"IF(ISBLANK('Data Input'!A54),\"\",SUM('Data Input'!H54,'Data Input'!I54,'Data Input'!N54,'Data Input'!S54))","v":""},{"$f":"IF(K49=\"\",\"\",K49/COUNTIF('Data Input'!$C$8:$AA$8,\"x\"))","v":""},{"$f":"IF(ISBLANK('Data Input'!A54),\"\",SUM('Data Input'!P54,'Data Input'!V54,'Data Input'!W54))","v":""},{"$f":"IF(M49=\"\",\"\",M49/COUNTIF('Data Input'!$C$8:$AA$8,\"÷\"))","v":""},{"$f":"IF(ISBLANK('Data Input'!A54),\"\",SUM('Data Input'!T54,'Data Input'!X54,'Data Input'!Z54,'Data Input'!AA54))","v":""},{"$f":"IF(O49=\"\",\"\",O49/COUNTIF('Data Input'!$C$8:$AA$8,\"F\"))","v":""}]
[{"$f":"IF('Data Input'!A55=0,\"\",'Data Input'!A55)","v":""},{"$f":"IF(ISBLANK('Data Input'!A55),\"\",COUNTIF('Data Input'!C55:AA55,\"\"))","v":""},{"$f":"IF(ISBLANK('Data Input'!A55),\"\",COUNTIF('Data Input'!C55:AA55,\"0\"))","v":""},{"$f":"IF(ISBLANK('Data Input'!A55),\"\",SUM(B50,C50))","v":""},{"$f":"IF(ISBLANK('Data Input'!A55),\"\",SUM('Data Input'!C55:AA55))","v":""},{"$f":"IF(E50=\"\",\"\",E50/(COUNTA('Data Input'!$C$8:$AA$8)))","v":""},{"$f":"IF(ISBLANK('Data Input'!A55),\"\",SUM('Data Input'!C55,'Data Input'!F55,'Data Input'!G55,'Data Input'!J55,'Data Input'!L55,'Data Input'!O55,'Data Input'!Q55,'Data Input'!R55,'Data Input'!U55))","v":""},{"$f":"IF(G50=\"\",\"\",G50/COUNTIF('Data Input'!$C$8:$AA$8,\"+\"))","v":""},{"$f":"IF(ISBLANK('Data Input'!A55),\"\",SUM('Data Input'!D55,'Data Input'!E55,'Data Input'!K55,'Data Input'!M55,'Data Input'!Y55))","v":""},{"$f":"IF(I50=\"\",\"\",I50/COUNTIF('Data Input'!$C$8:$AA$8,\"-\"))","v":""},{"$f":"IF(ISBLANK('Data Input'!A55),\"\",SUM('Data Input'!H55,'Data Input'!I55,'Data Input'!N55,'Data Input'!S55))","v":""},{"$f":"IF(K50=\"\",\"\",K50/COUNTIF('Data Input'!$C$8:$AA$8,\"x\"))","v":""},{"$f":"IF(ISBLANK('Data Input'!A55),\"\",SUM('Data Input'!P55,'Data Input'!V55,'Data Input'!W55))","v":""},{"$f":"IF(M50=\"\",\"\",M50/COUNTIF('Data Input'!$C$8:$AA$8,\"÷\"))","v":""},{"$f":"IF(ISBLANK('Data Input'!A55),\"\",SUM('Data Input'!T55,'Data Input'!X55,'Data Input'!Z55,'Data Input'!AA55))","v":""},{"$f":"IF(O50=\"\",\"\",O50/COUNTIF('Data Input'!$C$8:$AA$8,\"F\"))","v":""}]
[{"$f":"IF('Data Input'!A56=0,\"\",'Data Input'!A56)","v":""},{"$f":"IF(ISBLANK('Data Input'!A56),\"\",COUNTIF('Data Input'!C56:AA56,\"\"))","v":""},{"$f":"IF(ISBLANK('Data Input'!A56),\"\",COUNTIF('Data Input'!C56:AA56,\"0\"))","v":""},{"$f":"IF(ISBLANK('Data Input'!A56),\"\",SUM(B51,C51))","v":""},{"$f":"IF(ISBLANK('Data Input'!A56),\"\",SUM('Data Input'!C56:AA56))","v":""},{"$f":"IF(E51=\"\",\"\",E51/(COUNTA('Data Input'!$C$8:$AA$8)))","v":""},{"$f":"IF(ISBLANK('Data Input'!A56),\"\",SUM('Data Input'!C56,'Data Input'!F56,'Data Input'!G56,'Data Input'!J56,'Data Input'!L56,'Data Input'!O56,'Data Input'!Q56,'Data Input'!R56,'Data Input'!U56))","v":""},{"$f":"IF(G51=\"\",\"\",G51/COUNTIF('Data Input'!$C$8:$AA$8,\"+\"))","v":""},{"$f":"IF(ISBLANK('Data Input'!A56),\"\",SUM('Data Input'!D56,'Data Input'!E56,'Data Input'!K56,'Data Input'!M56,'Data Input'!Y56))","v":""},{"$f":"IF(I51=\"\",\"\",I51/COUNTIF('Data Input'!$C$8:$AA$8,\"-\"))","v":""},{"$f":"IF(ISBLANK('Data Input'!A56),\"\",SUM('Data Input'!H56,'Data Input'!I56,'Data Input'!N56,'Data Input'!S56))","v":""},{"$f":"IF(K51=\"\",\"\",K51/COUNTIF('Data Input'!$C$8:$AA$8,\"x\"))","v":""},{"$f":"IF(ISBLANK('Data Input'!A56),\"\",SUM('Data Input'!P56,'Data Input'!V56,'Data Input'!W56))","v":""},{"$f":"IF(M51=\"\",\"\",M51/COUNTIF('Data Input'!$C$8:$AA$8,\"÷\"))","v":""},{"$f":"IF(ISBLANK('Data Input'!A56),\"\",SUM('Data Input'!T56,'Data Input'!X56,'Data Input'!Z56,'Data Input'!AA56))","v":""},{"$f":"IF(O51=\"\",\"\",O51/COUNTIF('Data Input'!$C$8:$AA$8,\"F\"))","v":""}]
[{"$f":"IF('Data Input'!A57=0,\"\",'Data Input'!A57)","v":""},{"$f":"IF(ISBLANK('Data Input'!A57),\"\",COUNTIF('Data Input'!C57:AA57,\"\"))","v":""},{"$f":"IF(ISBLANK('Data Input'!A57),\"\",COUNTIF('Data Input'!C57:AA57,\"0\"))","v":""},{"$f":"IF(ISBLANK('Data Input'!A57),\"\",SUM(B52,C52))","v":""},{"$f":"IF(ISBLANK('Data Input'!A57),\"\",SUM('Data Input'!C57:AA57))","v":""},{"$f":"IF(E52=\"\",\"\",E52/(COUNTA('Data Input'!$C$8:$AA$8)))","v":""},{"$f":"IF(ISBLANK('Data Input'!A57),\"\",SUM('Data Input'!C57,'Data Input'!F57,'Data Input'!G57,'Data Input'!J57,'Data Input'!L57,'Data Input'!O57,'Data Input'!Q57,'Data Input'!R57,'Data Input'!U57))","v":""},{"$f":"IF(G52=\"\",\"\",G52/COUNTIF('Data Input'!$C$8:$AA$8,\"+\"))","v":""},{"$f":"IF(ISBLANK('Data Input'!A57),\"\",SUM('Data Input'!D57,'Data Input'!E57,'Data Input'!K57,'Data Input'!M57,'Data Input'!Y57))","v":""},{"$f":"IF(I52=\"\",\"\",I52/COUNTIF('Data Input'!$C$8:$AA$8,\"-\"))","v":""},{"$f":"IF(ISBLANK('Data Input'!A57),\"\",SUM('Data Input'!H57,'Data Input'!I57,'Data Input'!N57,'Data Input'!S57))","v":""},{"$f":"IF(K52=\"\",\"\",K52/COUNTIF('Data Input'!$C$8:$AA$8,\"x\"))","v":""},{"$f":"IF(ISBLANK('Data Input'!A57),\"\",SUM('Data Input'!P57,'Data Input'!V57,'Data Input'!W57))","v":""},{"$f":"IF(M52=\"\",\"\",M52/COUNTIF('Data Input'!$C$8:$AA$8,\"÷\"))","v":""},{"$f":"IF(ISBLANK('Data Input'!A57),\"\",SUM('Data Input'!T57,'Data Input'!X57,'Data Input'!Z57,'Data Input'!AA57))","v":""},{"$f":"IF(O52=\"\",\"\",O52/COUNTIF('Data Input'!$C$8:$AA$8,\"F\"))","v":""}]
[{"$f":"IF('Data Input'!A58=0,\"\",'Data Input'!A58)","v":""},{"$f":"IF(ISBLANK('Data Input'!A58),\"\",COUNTIF('Data Input'!C58:AA58,\"\"))","v":""},{"$f":"IF(ISBLANK('Data Input'!A58),\"\",COUNTIF('Data Input'!C58:AA58,\"0\"))","v":""},{"$f":"IF(ISBLANK('Data Input'!A58),\"\",SUM(B53,C53))","v":""},{"$f":"IF(ISBLANK('Data Input'!A58),\"\",SUM('Data Input'!C58:AA58))","v":""},{"$f":"IF(E53=\"\",\"\",E53/(COUNTA('Data Input'!$C$8:$AA$8)))","v":""},{"$f":"IF(ISBLANK('Data Input'!A58),\"\",SUM('Data Input'!C58,'Data Input'!F58,'Data Input'!G58,'Data Input'!J58,'Data Input'!L58,'Data Input'!O58,'Data Input'!Q58,'Data Input'!R58,'Data Input'!U58))","v":""},{"$f":"IF(G53=\"\",\"\",G53/COUNTIF('Data Input'!$C$8:$AA$8,\"+\"))","v":""},{"$f":"IF(ISBLANK('Data Input'!A58),\"\",SUM('Data Input'!D58,'Data Input'!E58,'Data Input'!K58,'Data Input'!M58,'Data Input'!Y58))","v":""},{"$f":"IF(I53=\"\",\"\",I53/COUNTIF('Data Input'!$C$8:$AA$8,\"-\"))","v":""},{"$f":"IF(ISBLANK('Data Input'!A58),\"\",SUM('Data Input'!H58,'Data Input'!I58,'Data Input'!N58,'Data Input'!S58))","v":""},{"$f":"IF(K53=\"\",\"\",K53/COUNTIF('Data Input'!$C$8:$AA$8,\"x\"))","v":""},{"$f":"IF(ISBLANK('Data Input'!A58),\"\",SUM('Data Input'!P58,'Data Input'!V58,'Data Input'!W58))","v":""},{"$f":"IF(M53=\"\",\"\",M53/COUNTIF('Data Input'!$C$8:$AA$8,\"÷\"))","v":""},{"$f":"IF(ISBLANK('Data Input'!A58),\"\",SUM('Data Input'!T58,'Data Input'!X58,'Data Input'!Z58,'Data Input'!AA58))","v":""},{"$f":"IF(O53=\"\",\"\",O53/COUNTIF('Data Input'!$C$8:$AA$8,\"F\"))","v":""}]
[{"$f":"IF('Data Input'!A59=0,\"\",'Data Input'!A59)","v":""},{"$f":"IF(ISBLANK('Data Input'!A59),\"\",COUNTIF('Data Input'!C59:AA59,\"\"))","v":""},{"$f":"IF(ISBLANK('Data Input'!A59),\"\",COUNTIF('Data Input'!C59:AA59,\"0\"))","v":""},{"$f":"IF(ISBLANK('Data Input'!A59),\"\",SUM(B54,C54))","v":""},{"$f":"IF(ISBLANK('Data Input'!A59),\"\",SUM('Data Input'!C59:AA59))","v":""},{"$f":"IF(E54=\"\",\"\",E54/(COUNTA('Data Input'!$C$8:$AA$8)))","v":""},{"$f":"IF(ISBLANK('Data Input'!A59),\"\",SUM('Data Input'!C59,'Data Input'!F59,'Data Input'!G59,'Data Input'!J59,'Data Input'!L59,'Data Input'!O59,'Data Input'!Q59,'Data Input'!R59,'Data Input'!U59))","v":""},{"$f":"IF(G54=\"\",\"\",G54/COUNTIF('Data Input'!$C$8:$AA$8,\"+\"))","v":""},{"$f":"IF(ISBLANK('Data Input'!A59),\"\",SUM('Data Input'!D59,'Data Input'!E59,'Data Input'!K59,'Data Input'!M59,'Data Input'!Y59))","v":""},{"$f":"IF(I54=\"\",\"\",I54/COUNTIF('Data Input'!$C$8:$AA$8,\"-\"))","v":""},{"$f":"IF(ISBLANK('Data Input'!A59),\"\",SUM('Data Input'!H59,'Data Input'!I59,'Data Input'!N59,'Data Input'!S59))","v":""},{"$f":"IF(K54=\"\",\"\",K54/COUNTIF('Data Input'!$C$8:$AA$8,\"x\"))","v":""},{"$f":"IF(ISBLANK('Data Input'!A59),\"\",SUM('Data Input'!P59,'Data Input'!V59,'Data Input'!W59))","v":""},{"$f":"IF(M54=\"\",\"\",M54/COUNTIF('Data Input'!$C$8:$AA$8,\"÷\"))","v":""},{"$f":"IF(ISBLANK('Data Input'!A59),\"\",SUM('Data Input'!T59,'Data Input'!X59,'Data Input'!Z59,'Data Input'!AA59))","v":""},{"$f":"IF(O54=\"\",\"\",O54/COUNTIF('Data Input'!$C$8:$AA$8,\"F\"))","v":""}]
[{"$f":"IF('Data Input'!A60=0,\"\",'Data Input'!A60)","v":""},{"$f":"IF(ISBLANK('Data Input'!A60),\"\",COUNTIF('Data Input'!C60:AA60,\"\"))","v":""},{"$f":"IF(ISBLANK('Data Input'!A60),\"\",COUNTIF('Data Input'!C60:AA60,\"0\"))","v":""},{"$f":"IF(ISBLANK('Data Input'!A60),\"\",SUM(B55,C55))","v":""},{"$f":"IF(ISBLANK('Data Input'!A60),\"\",SUM('Data Input'!C60:AA60))","v":""},{"$f":"IF(E55=\"\",\"\",E55/(COUNTA('Data Input'!$C$8:$AA$8)))","v":""},{"$f":"IF(ISBLANK('Data Input'!A60),\"\",SUM('Data Input'!C60,'Data Input'!F60,'Data Input'!G60,'Data Input'!J60,'Data Input'!L60,'Data Input'!O60,'Data Input'!Q60,'Data Input'!R60,'Data Input'!U60))","v":""},{"$f":"IF(G55=\"\",\"\",G55/COUNTIF('Data Input'!$C$8:$AA$8,\"+\"))","v":""},{"$f":"IF(ISBLANK('Data Input'!A60),\"\",SUM('Data Input'!D60,'Data Input'!E60,'Data Input'!K60,'Data Input'!M60,'Data Input'!Y60))","v":""},{"$f":"IF(I55=\"\",\"\",I55/COUNTIF('Data Input'!$C$8:$AA$8,\"-\"))","v":""},{"$f":"IF(ISBLANK('Data Input'!A60),\"\",SUM('Data Input'!H60,'Data Input'!I60,'Data Input'!N60,'Data Input'!S60))","v":""},{"$f":"IF(K55=\"\",\"\",K55/COUNTIF('Data Input'!$C$8:$AA$8,\"x\"))","v":""},{"$f":"IF(ISBLANK('Data Input'!A60),\"\",SUM('Data Input'!P60,'Data Input'!V60,'Data Input'!W60))","v":""},{"$f":"IF(M55=\"\",\"\",M55/COUNTIF('Data Input'!$C$8:$AA$8,\"÷\"))","v":""},{"$f":"IF(ISBLANK('Data Input'!A60),\"\",SUM('Data Input'!T60,'Data Input'!X60,'Data Input'!Z60,'Data Input'!AA60))","v":""},{"$f":"IF(O55=\"\",\"\",O55/COUNTIF('Data Input'!$C$8:$AA$8,\"F\"))","v":""}]
[{"$f":"IF('Data Input'!A61=0,\"\",'Data Input'!A61)","v":""},{"$f":"IF(ISBLANK('Data Input'!A61),\"\",COUNTIF('Data Input'!C61:AA61,\"\"))","v":""},{"$f":"IF(ISBLANK('Data Input'!A61),\"\",COUNTIF('Data Input'!C61:AA61,\"0\"))","v":""},{"$f":"IF(ISBLANK('Data Input'!A61),\"\",SUM(B56,C56))","v":""},{"$f":"IF(ISBLANK('Data Input'!A61),\"\",SUM('Data Input'!C61:AA61))","v":""},{"$f":"IF(E56=\"\",\"\",E56/(COUNTA('Data Input'!$C$8:$AA$8)))","v":""},{"$f":"IF(ISBLANK('Data Input'!A61),\"\",SUM('Data Input'!C61,'Data Input'!F61,'Data Input'!G61,'Data Input'!J61,'Data Input'!L61,'Data Input'!O61,'Data Input'!Q61,'Data Input'!R61,'Data Input'!U61))","v":""},{"$f":"IF(G56=\"\",\"\",G56/COUNTIF('Data Input'!$C$8:$AA$8,\"+\"))","v":""},{"$f":"IF(ISBLANK('Data Input'!A61),\"\",SUM('Data Input'!D61,'Data Input'!E61,'Data Input'!K61,'Data Input'!M61,'Data Input'!Y61))","v":""},{"$f":"IF(I56=\"\",\"\",I56/COUNTIF('Data Input'!$C$8:$AA$8,\"-\"))","v":""},{"$f":"IF(ISBLANK('Data Input'!A61),\"\",SUM('Data Input'!H61,'Data Input'!I61,'Data Input'!N61,'Data Input'!S61))","v":""},{"$f":"IF(K56=\"\",\"\",K56/COUNTIF('Data Input'!$C$8:$AA$8,\"x\"))","v":""},{"$f":"IF(ISBLANK('Data Input'!A61),\"\",SUM('Data Input'!P61,'Data Input'!V61,'Data Input'!W61))","v":""},{"$f":"IF(M56=\"\",\"\",M56/COUNTIF('Data Input'!$C$8:$AA$8,\"÷\"))","v":""},{"$f":"IF(ISBLANK('Data Input'!A61),\"\",SUM('Data Input'!T61,'Data Input'!X61,'Data Input'!Z61,'Data Input'!AA61))","v":""},{"$f":"IF(O56=\"\",\"\",O56/COUNTIF('Data Input'!$C$8:$AA$8,\"F\"))","v":""}]
[{"$f":"IF('Data Input'!A62=0,\"\",'Data Input'!A62)","v":""},{"$f":"IF(ISBLANK('Data Input'!A62),\"\",COUNTIF('Data Input'!C62:AA62,\"\"))","v":""},{"$f":"IF(ISBLANK('Data Input'!A62),\"\",COUNTIF('Data Input'!C62:AA62,\"0\"))","v":""},{"$f":"IF(ISBLANK('Data Input'!A62),\"\",SUM(B57,C57))","v":""},{"$f":"IF(ISBLANK('Data Input'!A62),\"\",SUM('Data Input'!C62:AA62))","v":""},{"$f":"IF(E57=\"\",\"\",E57/(COUNTA('Data Input'!$C$8:$AA$8)))","v":""},{"$f":"IF(ISBLANK('Data Input'!A62),\"\",SUM('Data Input'!C62,'Data Input'!F62,'Data Input'!G62,'Data Input'!J62,'Data Input'!L62,'Data Input'!O62,'Data Input'!Q62,'Data Input'!R62,'Data Input'!U62))","v":""},{"$f":"IF(G57=\"\",\"\",G57/COUNTIF('Data Input'!$C$8:$AA$8,\"+\"))","v":""},{"$f":"IF(ISBLANK('Data Input'!A62),\"\",SUM('Data Input'!D62,'Data Input'!E62,'Data Input'!K62,'Data Input'!M62,'Data Input'!Y62))","v":""},{"$f":"IF(I57=\"\",\"\",I57/COUNTIF('Data Input'!$C$8:$AA$8,\"-\"))","v":""},{"$f":"IF(ISBLANK('Data Input'!A62),\"\",SUM('Data Input'!H62,'Data Input'!I62,'Data Input'!N62,'Data Input'!S62))","v":""},{"$f":"IF(K57=\"\",\"\",K57/COUNTIF('Data Input'!$C$8:$AA$8,\"x\"))","v":""},{"$f":"IF(ISBLANK('Data Input'!A62),\"\",SUM('Data Input'!P62,'Data Input'!V62,'Data Input'!W62))","v":""},{"$f":"IF(M57=\"\",\"\",M57/COUNTIF('Data Input'!$C$8:$AA$8,\"÷\"))","v":""},{"$f":"IF(ISBLANK('Data Input'!A62),\"\",SUM('Data Input'!T62,'Data Input'!X62,'Data Input'!Z62,'Data Input'!AA62))","v":""},{"$f":"IF(O57=\"\",\"\",O57/COUNTIF('Data Input'!$C$8:$AA$8,\"F\"))","v":""}]
[{"$f":"IF('Data Input'!A63=0,\"\",'Data Input'!A63)","v":""},{"$f":"IF(ISBLANK('Data Input'!A63),\"\",COUNTIF('Data Input'!C63:AA63,\"\"))","v":""},{"$f":"IF(ISBLANK('Data Input'!A63),\"\",COUNTIF('Data Input'!C63:AA63,\"0\"))","v":""},{"$f":"IF(ISBLANK('Data Input'!A63),\"\",SUM(B58,C58))","v":""},{"$f":"IF(ISBLANK('Data Input'!A63),\"\",SUM('Data Input'!C63:AA63))","v":""},{"$f":"IF(E58=\"\",\"\",E58/(COUNTA('Data Input'!$C$8:$AA$8)))","v":""},{"$f":"IF(ISBLANK('Data Input'!A63),\"\",SUM('Data Input'!C63,'Data Input'!F63,'Data Input'!G63,'Data Input'!J63,'Data Input'!L63,'Data Input'!O63,'Data Input'!Q63,'Data Input'!R63,'Data Input'!U63))","v":""},{"$f":"IF(G58=\"\",\"\",G58/COUNTIF('Data Input'!$C$8:$AA$8,\"+\"))","v":""},{"$f":"IF(ISBLANK('Data Input'!A63),\"\",SUM('Data Input'!D63,'Data Input'!E63,'Data Input'!K63,'Data Input'!M63,'Data Input'!Y63))","v":""},{"$f":"IF(I58=\"\",\"\",I58/COUNTIF('Data Input'!$C$8:$AA$8,\"-\"))","v":""},{"$f":"IF(ISBLANK('Data Input'!A63),\"\",SUM('Data Input'!H63,'Data Input'!I63,'Data Input'!N63,'Data Input'!S63))","v":""},{"$f":"IF(K58=\"\",\"\",K58/COUNTIF('Data Input'!$C$8:$AA$8,\"x\"))","v":""},{"$f":"IF(ISBLANK('Data Input'!A63),\"\",SUM('Data Input'!P63,'Data Input'!V63,'Data Input'!W63))","v":""},{"$f":"IF(M58=\"\",\"\",M58/COUNTIF('Data Input'!$C$8:$AA$8,\"÷\"))","v":""},{"$f":"IF(ISBLANK('Data Input'!A63),\"\",SUM('Data Input'!T63,'Data Input'!X63,'Data Input'!Z63,'Data Input'!AA63))","v":""},{"$f":"IF(O58=\"\",\"\",O58/COUNTIF('Data Input'!$C$8:$AA$8,\"F\"))","v":""}]
[{"$f":"IF('Data Input'!A64=0,\"\",'Data Input'!A64)","v":""},{"$f":"IF(ISBLANK('Data Input'!A64),\"\",COUNTIF('Data Input'!C64:AA64,\"\"))","v":""},{"$f":"IF(ISBLANK('Data Input'!A64),\"\",COUNTIF('Data Input'!C64:AA64,\"0\"))","v":""},{"$f":"IF(ISBLANK('Data Input'!A64),\"\",SUM(B59,C59))","v":""},{"$f":"IF(ISBLANK('Data Input'!A64),\"\",SUM('Data Input'!C64:AA64))","v":""},{"$f":"IF(E59=\"\",\"\",E59/(COUNTA('Data Input'!$C$8:$AA$8)))","v":""},{"$f":"IF(ISBLANK('Data Input'!A64),\"\",SUM('Data Input'!C64,'Data Input'!F64,'Data Input'!G64,'Data Input'!J64,'Data Input'!L64,'Data Input'!O64,'Data Input'!Q64,'Data Input'!R64,'Data Input'!U64))","v":""},{"$f":"IF(G59=\"\",\"\",G59/COUNTIF('Data Input'!$C$8:$AA$8,\"+\"))","v":""},{"$f":"IF(ISBLANK('Data Input'!A64),\"\",SUM('Data Input'!D64,'Data Input'!E64,'Data Input'!K64,'Data Input'!M64,'Data Input'!Y64))","v":""},{"$f":"IF(I59=\"\",\"\",I59/COUNTIF('Data Input'!$C$8:$AA$8,\"-\"))","v":""},{"$f":"IF(ISBLANK('Data Input'!A64),\"\",SUM('Data Input'!H64,'Data Input'!I64,'Data Input'!N64,'Data Input'!S64))","v":""},{"$f":"IF(K59=\"\",\"\",K59/COUNTIF('Data Input'!$C$8:$AA$8,\"x\"))","v":""},{"$f":"IF(ISBLANK('Data Input'!A64),\"\",SUM('Data Input'!P64,'Data Input'!V64,'Data Input'!W64))","v":""},{"$f":"IF(M59=\"\",\"\",M59/COUNTIF('Data Input'!$C$8:$AA$8,\"÷\"))","v":""},{"$f":"IF(ISBLANK('Data Input'!A64),\"\",SUM('Data Input'!T64,'Data Input'!X64,'Data Input'!Z64,'Data Input'!AA64))","v":""},{"$f":"IF(O59=\"\",\"\",O59/COUNTIF('Data Input'!$C$8:$AA$8,\"F\"))","v":""}]
[{"$f":"IF('Data Input'!A65=0,\"\",'Data Input'!A65)","v":""},{"$f":"IF(ISBLANK('Data Input'!A65),\"\",COUNTIF('Data Input'!C65:AA65,\"\"))","v":""},{"$f":"IF(ISBLANK('Data Input'!A65),\"\",COUNTIF('Data Input'!C65:AA65,\"0\"))","v":""},{"$f":"IF(ISBLANK('Data Input'!A65),\"\",SUM(B60,C60))","v":""},{"$f":"IF(ISBLANK('Data Input'!A65),\"\",SUM('Data Input'!C65:AA65))","v":""},{"$f":"IF(E60=\"\",\"\",E60/(COUNTA('Data Input'!$C$8:$AA$8)))","v":""},{"$f":"IF(ISBLANK('Data Input'!A65),\"\",SUM('Data Input'!C65,'Data Input'!F65,'Data Input'!G65,'Data Input'!J65,'Data Input'!L65,'Data Input'!O65,'Data Input'!Q65,'Data Input'!R65,'Data Input'!U65))","v":""},{"$f":"IF(G60=\"\",\"\",G60/COUNTIF('Data Input'!$C$8:$AA$8,\"+\"))","v":""},{"$f":"IF(ISBLANK('Data Input'!A65),\"\",SUM('Data Input'!D65,'Data Input'!E65,'Data Input'!K65,'Data Input'!M65,'Data Input'!Y65))","v":""},{"$f":"IF(I60=\"\",\"\",I60/COUNTIF('Data Input'!$C$8:$AA$8,\"-\"))","v":""},{"$f":"IF(ISBLANK('Data Input'!A65),\"\",SUM('Data Input'!H65,'Data Input'!I65,'Data Input'!N65,'Data Input'!S65))","v":""},{"$f":"IF(K60=\"\",\"\",K60/COUNTIF('Data Input'!$C$8:$AA$8,\"x\"))","v":""},{"$f":"IF(ISBLANK('Data Input'!A65),\"\",SUM('Data Input'!P65,'Data Input'!V65,'Data Input'!W65))","v":""},{"$f":"IF(M60=\"\",\"\",M60/COUNTIF('Data Input'!$C$8:$AA$8,\"÷\"))","v":""},{"$f":"IF(ISBLANK('Data Input'!A65),\"\",SUM('Data Input'!T65,'Data Input'!X65,'Data Input'!Z65,'Data Input'!AA65))","v":""},{"$f":"IF(O60=\"\",\"\",O60/COUNTIF('Data Input'!$C$8:$AA$8,\"F\"))","v":""}]
[{"$f":"IF('Data Input'!A66=0,\"\",'Data Input'!A66)","v":""},{"$f":"IF(ISBLANK('Data Input'!A66),\"\",COUNTIF('Data Input'!C66:AA66,\"\"))","v":""},{"$f":"IF(ISBLANK('Data Input'!A66),\"\",COUNTIF('Data Input'!C66:AA66,\"0\"))","v":""},{"$f":"IF(ISBLANK('Data Input'!A66),\"\",SUM(B61,C61))","v":""},{"$f":"IF(ISBLANK('Data Input'!A66),\"\",SUM('Data Input'!C66:AA66))","v":""},{"$f":"IF(E61=\"\",\"\",E61/(COUNTA('Data Input'!$C$8:$AA$8)))","v":""},{"$f":"IF(ISBLANK('Data Input'!A66),\"\",SUM('Data Input'!C66,'Data Input'!F66,'Data Input'!G66,'Data Input'!J66,'Data Input'!L66,'Data Input'!O66,'Data Input'!Q66,'Data Input'!R66,'Data Input'!U66))","v":""},{"$f":"IF(G61=\"\",\"\",G61/COUNTIF('Data Input'!$C$8:$AA$8,\"+\"))","v":""},{"$f":"IF(ISBLANK('Data Input'!A66),\"\",SUM('Data Input'!D66,'Data Input'!E66,'Data Input'!K66,'Data Input'!M66,'Data Input'!Y66))","v":""},{"$f":"IF(I61=\"\",\"\",I61/COUNTIF('Data Input'!$C$8:$AA$8,\"-\"))","v":""},{"$f":"IF(ISBLANK('Data Input'!A66),\"\",SUM('Data Input'!H66,'Data Input'!I66,'Data Input'!N66,'Data Input'!S66))","v":""},{"$f":"IF(K61=\"\",\"\",K61/COUNTIF('Data Input'!$C$8:$AA$8,\"x\"))","v":""},{"$f":"IF(ISBLANK('Data Input'!A66),\"\",SUM('Data Input'!P66,'Data Input'!V66,'Data Input'!W66))","v":""},{"$f":"IF(M61=\"\",\"\",M61/COUNTIF('Data Input'!$C$8:$AA$8,\"÷\"))","v":""},{"$f":"IF(ISBLANK('Data Input'!A66),\"\",SUM('Data Input'!T66,'Data Input'!X66,'Data Input'!Z66,'Data Input'!AA66))","v":""},{"$f":"IF(O61=\"\",\"\",O61/COUNTIF('Data Input'!$C$8:$AA$8,\"F\"))","v":""}]
[{"$f":"IF('Data Input'!A67=0,\"\",'Data Input'!A67)","v":""},{"$f":"IF(ISBLANK('Data Input'!A67),\"\",COUNTIF('Data Input'!C67:AA67,\"\"))","v":""},{"$f":"IF(ISBLANK('Data Input'!A67),\"\",COUNTIF('Data Input'!C67:AA67,\"0\"))","v":""},{"$f":"IF(ISBLANK('Data Input'!A67),\"\",SUM(B62,C62))","v":""},{"$f":"IF(ISBLANK('Data Input'!A67),\"\",SUM('Data Input'!C67:AA67))","v":""},{"$f":"IF(E62=\"\",\"\",E62/(COUNTA('Data Input'!$C$8:$AA$8)))","v":""},{"$f":"IF(ISBLANK('Data Input'!A67),\"\",SUM('Data Input'!C67,'Data Input'!F67,'Data Input'!G67,'Data Input'!J67,'Data Input'!L67,'Data Input'!O67,'Data Input'!Q67,'Data Input'!R67,'Data Input'!U67))","v":""},{"$f":"IF(G62=\"\",\"\",G62/COUNTIF('Data Input'!$C$8:$AA$8,\"+\"))","v":""},{"$f":"IF(ISBLANK('Data Input'!A67),\"\",SUM('Data Input'!D67,'Data Input'!E67,'Data Input'!K67,'Data Input'!M67,'Data Input'!Y67))","v":""},{"$f":"IF(I62=\"\",\"\",I62/COUNTIF('Data Input'!$C$8:$AA$8,\"-\"))","v":""},{"$f":"IF(ISBLANK('Data Input'!A67),\"\",SUM('Data Input'!H67,'Data Input'!I67,'Data Input'!N67,'Data Input'!S67))","v":""},{"$f":"IF(K62=\"\",\"\",K62/COUNTIF('Data Input'!$C$8:$AA$8,\"x\"))","v":""},{"$f":"IF(ISBLANK('Data Input'!A67),\"\",SUM('Data Input'!P67,'Data Input'!V67,'Data Input'!W67))","v":""},{"$f":"IF(M62=\"\",\"\",M62/COUNTIF('Data Input'!$C$8:$AA$8,\"÷\"))","v":""},{"$f":"IF(ISBLANK('Data Input'!A67),\"\",SUM('Data Input'!T67,'Data Input'!X67,'Data Input'!Z67,'Data Input'!AA67))","v":""},{"$f":"IF(O62=\"\",\"\",O62/COUNTIF('Data Input'!$C$8:$AA$8,\"F\"))","v":""}]
[{"$f":"IF('Data Input'!A68=0,\"\",'Data Input'!A68)","v":""},{"$f":"IF(ISBLANK('Data Input'!A68),\"\",COUNTIF('Data Input'!C68:AA68,\"\"))","v":""},{"$f":"IF(ISBLANK('Data Input'!A68),\"\",COUNTIF('Data Input'!C68:AA68,\"0\"))","v":""},{"$f":"IF(ISBLANK('Data Input'!A68),\"\",SUM(B63,C63))","v":""},{"$f":"IF(ISBLANK('Data Input'!A68),\"\",SUM('Data Input'!C68:AA68))","v":""},{"$f":"IF(E63=\"\",\"\",E63/(COUNTA('Data Input'!$C$8:$AA$8)))","v":""},{"$f":"IF(ISBLANK('Data Input'!A68),\"\",SUM('Data Input'!C68,'Data Input'!F68,'Data Input'!G68,'Data Input'!J68,'Data Input'!L68,'Data Input'!O68,'Data Input'!Q68,'Data Input'!R68,'Data Input'!U68))","v":""},{"$f":"IF(G63=\"\",\"\",G63/COUNTIF('Data Input'!$C$8:$AA$8,\"+\"))","v":""},{"$f":"IF(ISBLANK('Data Input'!A68),\"\",SUM('Data Input'!D68,'Data Input'!E68,'Data Input'!K68,'Data Input'!M68,'Data Input'!Y68))","v":""},{"$f":"IF(I63=\"\",\"\",I63/COUNTIF('Data Input'!$C$8:$AA$8,\"-\"))","v":""},{"$f":"IF(ISBLANK('Data Input'!A68),\"\",SUM('Data Input'!H68,'Data Input'!I68,'Data Input'!N68,'Data Input'!S68))","v":""},{"$f":"IF(K63=\"\",\"\",K63/COUNTIF('Data Input'!$C$8:$AA$8,\"x\"))","v":""},{"$f":"IF(ISBLANK('Data Input'!A68),\"\",SUM('Data Input'!P68,'Data Input'!V68,'Data Input'!W68))","v":""},{"$f":"IF(M63=\"\",\"\",M63/COUNTIF('Data Input'!$C$8:$AA$8,\"÷\"))","v":""},{"$f":"IF(ISBLANK('Data Input'!A68),\"\",SUM('Data Input'!T68,'Data Input'!X68,'Data Input'!Z68,'Data Input'!AA68))","v":""},{"$f":"IF(O63=\"\",\"\",O63/COUNTIF('Data Input'!$C$8:$AA$8,\"F\"))","v":""}]
[{"$f":"IF('Data Input'!A69=0,\"\",'Data Input'!A69)","v":""},{"$f":"IF(ISBLANK('Data Input'!A69),\"\",COUNTIF('Data Input'!C69:AA69,\"\"))","v":""},{"$f":"IF(ISBLANK('Data Input'!A69),\"\",COUNTIF('Data Input'!C69:AA69,\"0\"))","v":""},{"$f":"IF(ISBLANK('Data Input'!A69),\"\",SUM(B64,C64))","v":""},{"$f":"IF(ISBLANK('Data Input'!A69),\"\",SUM('Data Input'!C69:AA69))","v":""},{"$f":"IF(E64=\"\",\"\",E64/(COUNTA('Data Input'!$C$8:$AA$8)))","v":""},{"$f":"IF(ISBLANK('Data Input'!A69),\"\",SUM('Data Input'!C69,'Data Input'!F69,'Data Input'!G69,'Data Input'!J69,'Data Input'!L69,'Data Input'!O69,'Data Input'!Q69,'Data Input'!R69,'Data Input'!U69))","v":""},{"$f":"IF(G64=\"\",\"\",G64/COUNTIF('Data Input'!$C$8:$AA$8,\"+\"))","v":""},{"$f":"IF(ISBLANK('Data Input'!A69),\"\",SUM('Data Input'!D69,'Data Input'!E69,'Data Input'!K69,'Data Input'!M69,'Data Input'!Y69))","v":""},{"$f":"IF(I64=\"\",\"\",I64/COUNTIF('Data Input'!$C$8:$AA$8,\"-\"))","v":""},{"$f":"IF(ISBLANK('Data Input'!A69),\"\",SUM('Data Input'!H69,'Data Input'!I69,'Data Input'!N69,'Data Input'!S69))","v":""},{"$f":"IF(K64=\"\",\"\",K64/COUNTIF('Data Input'!$C$8:$AA$8,\"x\"))","v":""},{"$f":"IF(ISBLANK('Data Input'!A69),\"\",SUM('Data Input'!P69,'Data Input'!V69,'Data Input'!W69))","v":""},{"$f":"IF(M64=\"\",\"\",M64/COUNTIF('Data Input'!$C$8:$AA$8,\"÷\"))","v":""},{"$f":"IF(ISBLANK('Data Input'!A69),\"\",SUM('Data Input'!T69,'Data Input'!X69,'Data Input'!Z69,'Data Input'!AA69))","v":""},{"$f":"IF(O64=\"\",\"\",O64/COUNTIF('Data Input'!$C$8:$AA$8,\"F\"))","v":""}]
[{"$f":"IF('Data Input'!A70=0,\"\",'Data Input'!A70)","v":""},{"$f":"IF(ISBLANK('Data Input'!A70),\"\",COUNTIF('Data Input'!C70:AA70,\"\"))","v":""},{"$f":"IF(ISBLANK('Data Input'!A70),\"\",COUNTIF('Data Input'!C70:AA70,\"0\"))","v":""},{"$f":"IF(ISBLANK('Data Input'!A70),\"\",SUM(B65,C65))","v":""},{"$f":"IF(ISBLANK('Data Input'!A70),\"\",SUM('Data Input'!C70:AA70))","v":""},{"$f":"IF(E65=\"\",\"\",E65/(COUNTA('Data Input'!$C$8:$AA$8)))","v":""},{"$f":"IF(ISBLANK('Data Input'!A70),\"\",SUM('Data Input'!C70,'Data Input'!F70,'Data Input'!G70,'Data Input'!J70,'Data Input'!L70,'Data Input'!O70,'Data Input'!Q70,'Data Input'!R70,'Data Input'!U70))","v":""},{"$f":"IF(G65=\"\",\"\",G65/COUNTIF('Data Input'!$C$8:$AA$8,\"+\"))","v":""},{"$f":"IF(ISBLANK('Data Input'!A70),\"\",SUM('Data Input'!D70,'Data Input'!E70,'Data Input'!K70,'Data Input'!M70,'Data Input'!Y70))","v":""},{"$f":"IF(I65=\"\",\"\",I65/COUNTIF('Data Input'!$C$8:$AA$8,\"-\"))","v":""},{"$f":"IF(ISBLANK('Data Input'!A70),\"\",SUM('Data Input'!H70,'Data Input'!I70,'Data Input'!N70,'Data Input'!S70))","v":""},{"$f":"IF(K65=\"\",\"\",K65/COUNTIF('Data Input'!$C$8:$AA$8,\"x\"))","v":""},{"$f":"IF(ISBLANK('Data Input'!A70),\"\",SUM('Data Input'!P70,'Data Input'!V70,'Data Input'!W70))","v":""},{"$f":"IF(M65=\"\",\"\",M65/COUNTIF('Data Input'!$C$8:$AA$8,\"÷\"))","v":""},{"$f":"IF(ISBLANK('Data Input'!A70),\"\",SUM('Data Input'!T70,'Data Input'!X70,'Data Input'!Z70,'Data Input'!AA70))","v":""},{"$f":"IF(O65=\"\",\"\",O65/COUNTIF('Data Input'!$C$8:$AA$8,\"F\"))","v":""}]
[{"$f":"IF('Data Input'!A71=0,\"\",'Data Input'!A71)","v":""},{"$f":"IF(ISBLANK('Data Input'!A71),\"\",COUNTIF('Data Input'!C71:AA71,\"\"))","v":""},{"$f":"IF(ISBLANK('Data Input'!A71),\"\",COUNTIF('Data Input'!C71:AA71,\"0\"))","v":""},{"$f":"IF(ISBLANK('Data Input'!A71),\"\",SUM(B66,C66))","v":""},{"$f":"IF(ISBLANK('Data Input'!A71),\"\",SUM('Data Input'!C71:AA71))","v":""},{"$f":"IF(E66=\"\",\"\",E66/(COUNTA('Data Input'!$C$8:$AA$8)))","v":""},{"$f":"IF(ISBLANK('Data Input'!A71),\"\",SUM('Data Input'!C71,'Data Input'!F71,'Data Input'!G71,'Data Input'!J71,'Data Input'!L71,'Data Input'!O71,'Data Input'!Q71,'Data Input'!R71,'Data Input'!U71))","v":""},{"$f":"IF(G66=\"\",\"\",G66/COUNTIF('Data Input'!$C$8:$AA$8,\"+\"))","v":""},{"$f":"IF(ISBLANK('Data Input'!A71),\"\",SUM('Data Input'!D71,'Data Input'!E71,'Data Input'!K71,'Data Input'!M71,'Data Input'!Y71))","v":""},{"$f":"IF(I66=\"\",\"\",I66/COUNTIF('Data Input'!$C$8:$AA$8,\"-\"))","v":""},{"$f":"IF(ISBLANK('Data Input'!A71),\"\",SUM('Data Input'!H71,'Data Input'!I71,'Data Input'!N71,'Data Input'!S71))","v":""},{"$f":"IF(K66=\"\",\"\",K66/COUNTIF('Data Input'!$C$8:$AA$8,\"x\"))","v":""},{"$f":"IF(ISBLANK('Data Input'!A71),\"\",SUM('Data Input'!P71,'Data Input'!V71,'Data Input'!W71))","v":""},{"$f":"IF(M66=\"\",\"\",M66/COUNTIF('Data Input'!$C$8:$AA$8,\"÷\"))","v":""},{"$f":"IF(ISBLANK('Data Input'!A71),\"\",SUM('Data Input'!T71,'Data Input'!X71,'Data Input'!Z71,'Data Input'!AA71))","v":""},{"$f":"IF(O66=\"\",\"\",O66/COUNTIF('Data Input'!$C$8:$AA$8,\"F\"))","v":""}]
[{"$f":"IF('Data Input'!A72=0,\"\",'Data Input'!A72)","v":""},{"$f":"IF(ISBLANK('Data Input'!A72),\"\",COUNTIF('Data Input'!C72:AA72,\"\"))","v":""},{"$f":"IF(ISBLANK('Data Input'!A72),\"\",COUNTIF('Data Input'!C72:AA72,\"0\"))","v":""},{"$f":"IF(ISBLANK('Data Input'!A72),\"\",SUM(B67,C67))","v":""},{"$f":"IF(ISBLANK('Data Input'!A72),\"\",SUM('Data Input'!C72:AA72))","v":""},{"$f":"IF(E67=\"\",\"\",E67/(COUNTA('Data Input'!$C$8:$AA$8)))","v":""},{"$f":"IF(ISBLANK('Data Input'!A72),\"\",SUM('Data Input'!C72,'Data Input'!F72,'Data Input'!G72,'Data Input'!J72,'Data Input'!L72,'Data Input'!O72,'Data Input'!Q72,'Data Input'!R72,'Data Input'!U72))","v":""},{"$f":"IF(G67=\"\",\"\",G67/COUNTIF('Data Input'!$C$8:$AA$8,\"+\"))","v":""},{"$f":"IF(ISBLANK('Data Input'!A72),\"\",SUM('Data Input'!D72,'Data Input'!E72,'Data Input'!K72,'Data Input'!M72,'Data Input'!Y72))","v":""},{"$f":"IF(I67=\"\",\"\",I67/COUNTIF('Data Input'!$C$8:$AA$8,\"-\"))","v":""},{"$f":"IF(ISBLANK('Data Input'!A72),\"\",SUM('Data Input'!H72,'Data Input'!I72,'Data Input'!N72,'Data Input'!S72))","v":""},{"$f":"IF(K67=\"\",\"\",K67/COUNTIF('Data Input'!$C$8:$AA$8,\"x\"))","v":""},{"$f":"IF(ISBLANK('Data Input'!A72),\"\",SUM('Data Input'!P72,'Data Input'!V72,'Data Input'!W72))","v":""},{"$f":"IF(M67=\"\",\"\",M67/COUNTIF('Data Input'!$C$8:$AA$8,\"÷\"))","v":""},{"$f":"IF(ISBLANK('Data Input'!A72),\"\",SUM('Data Input'!T72,'Data Input'!X72,'Data Input'!Z72,'Data Input'!AA72))","v":""},{"$f":"IF(O67=\"\",\"\",O67/COUNTIF('Data Input'!$C$8:$AA$8,\"F\"))","v":""}]
[{"$f":"IF('Data Input'!A73=0,\"\",'Data Input'!A73)","v":""},{"$f":"IF(ISBLANK('Data Input'!A73),\"\",COUNTIF('Data Input'!C73:AA73,\"\"))","v":""},{"$f":"IF(ISBLANK('Data Input'!A73),\"\",COUNTIF('Data Input'!C73:AA73,\"0\"))","v":""},{"$f":"IF(ISBLANK('Data Input'!A73),\"\",SUM(B68,C68))","v":""},{"$f":"IF(ISBLANK('Data Input'!A73),\"\",SUM('Data Input'!C73:AA73))","v":""},{"$f":"IF(E68=\"\",\"\",E68/(COUNTA('Data Input'!$C$8:$AA$8)))","v":""},{"$f":"IF(ISBLANK('Data Input'!A73),\"\",SUM('Data Input'!C73,'Data Input'!F73,'Data Input'!G73,'Data Input'!J73,'Data Input'!L73,'Data Input'!O73,'Data Input'!Q73,'Data Input'!R73,'Data Input'!U73))","v":""},{"$f":"IF(G68=\"\",\"\",G68/COUNTIF('Data Input'!$C$8:$AA$8,\"+\"))","v":""},{"$f":"IF(ISBLANK('Data Input'!A73),\"\",SUM('Data Input'!D73,'Data Input'!E73,'Data Input'!K73,'Data Input'!M73,'Data Input'!Y73))","v":""},{"$f":"IF(I68=\"\",\"\",I68/COUNTIF('Data Input'!$C$8:$AA$8,\"-\"))","v":""},{"$f":"IF(ISBLANK('Data Input'!A73),\"\",SUM('Data Input'!H73,'Data Input'!I73,'Data Input'!N73,'Data Input'!S73))","v":""},{"$f":"IF(K68=\"\",\"\",K68/COUNTIF('Data Input'!$C$8:$AA$8,\"x\"))","v":""},{"$f":"IF(ISBLANK('Data Input'!A73),\"\",SUM('Data Input'!P73,'Data Input'!V73,'Data Input'!W73))","v":""},{"$f":"IF(M68=\"\",\"\",M68/COUNTIF('Data Input'!$C$8:$AA$8,\"÷\"))","v":""},{"$f":"IF(ISBLANK('Data Input'!A73),\"\",SUM('Data Input'!T73,'Data Input'!X73,'Data Input'!Z73,'Data Input'!AA73))","v":""},{"$f":"IF(O68=\"\",\"\",O68/COUNTIF('Data Input'!$C$8:$AA$8,\"F\"))","v":""}]
[{"$f":"IF('Data Input'!A74=0,\"\",'Data Input'!A74)","v":""},{"$f":"IF(ISBLANK('Data Input'!A74),\"\",COUNTIF('Data Input'!C74:AA74,\"\"))","v":""},{"$f":"IF(ISBLANK('Data Input'!A74),\"\",COUNTIF('Data Input'!C74:AA74,\"0\"))","v":""},{"$f":"IF(ISBLANK('Data Input'!A74),\"\",SUM(B69,C69))","v":""},{"$f":"IF(ISBLANK('Data Input'!A74),\"\",SUM('Data Input'!C74:AA74))","v":""},{"$f":"IF(E69=\"\",\"\",E69/(COUNTA('Data Input'!$C$8:$AA$8)))","v":""},{"$f":"IF(ISBLANK('Data Input'!A74),\"\",SUM('Data Input'!C74,'Data Input'!F74,'Data Input'!G74,'Data Input'!J74,'Data Input'!L74,'Data Input'!O74,'Data Input'!Q74,'Data Input'!R74,'Data Input'!U74))","v":""},{"$f":"IF(G69=\"\",\"\",G69/COUNTIF('Data Input'!$C$8:$AA$8,\"+\"))","v":""},{"$f":"IF(ISBLANK('Data Input'!A74),\"\",SUM('Data Input'!D74,'Data Input'!E74,'Data Input'!K74,'Data Input'!M74,'Data Input'!Y74))","v":""},{"$f":"IF(I69=\"\",\"\",I69/COUNTIF('Data Input'!$C$8:$AA$8,\"-\"))","v":""},{"$f":"IF(ISBLANK('Data Input'!A74),\"\",SUM('Data Input'!H74,'Data Input'!I74,'Data Input'!N74,'Data Input'!S74))","v":""},{"$f":"IF(K69=\"\",\"\",K69/COUNTIF('Data Input'!$C$8:$AA$8,\"x\"))","v":""},{"$f":"IF(ISBLANK('Data Input'!A74),\"\",SUM('Data Input'!P74,'Data Input'!V74,'Data Input'!W74))","v":""},{"$f":"IF(M69=\"\",\"\",M69/COUNTIF('Data Input'!$C$8:$AA$8,\"÷\"))","v":""},{"$f":"IF(ISBLANK('Data Input'!A74),\"\",SUM('Data Input'!T74,'Data Input'!X74,'Data Input'!Z74,'Data Input'!AA74))","v":""},{"$f":"IF(O69=\"\",\"\",O69/COUNTIF('Data Input'!$C$8:$AA$8,\"F\"))","v":""}]
[{"$f":"IF('Data Input'!A75=0,\"\",'Data Input'!A75)","v":""},{"$f":"IF(ISBLANK('Data Input'!A75),\"\",COUNTIF('Data Input'!C75:AA75,\"\"))","v":""},{"$f":"IF(ISBLANK('Data Input'!A75),\"\",COUNTIF('Data Input'!C75:AA75,\"0\"))","v":""},{"$f":"IF(ISBLANK('Data Input'!A75),\"\",SUM(B70,C70))","v":""},{"$f":"IF(ISBLANK('Data Input'!A75),\"\",SUM('Data Input'!C75:AA75))","v":""},{"$f":"IF(E70=\"\",\"\",E70/(COUNTA('Data Input'!$C$8:$AA$8)))","v":""},{"$f":"IF(ISBLANK('Data Input'!A75),\"\",SUM('Data Input'!C75,'Data Input'!F75,'Data Input'!G75,'Data Input'!J75,'Data Input'!L75,'Data Input'!O75,'Data Input'!Q75,'Data Input'!R75,'Data Input'!U75))","v":""},{"$f":"IF(G70=\"\",\"\",G70/COUNTIF('Data Input'!$C$8:$AA$8,\"+\"))","v":""},{"$f":"IF(ISBLANK('Data Input'!A75),\"\",SUM('Data Input'!D75,'Data Input'!E75,'Data Input'!K75,'Data Input'!M75,'Data Input'!Y75))","v":""},{"$f":"IF(I70=\"\",\"\",I70/COUNTIF('Data Input'!$C$8:$AA$8,\"-\"))","v":""},{"$f":"IF(ISBLANK('Data Input'!A75),\"\",SUM('Data Input'!H75,'Data Input'!I75,'Data Input'!N75,'Data Input'!S75))","v":""},{"$f":"IF(K70=\"\",\"\",K70/COUNTIF('Data Input'!$C$8:$AA$8,\"x\"))","v":""},{"$f":"IF(ISBLANK('Data Input'!A75),\"\",SUM('Data Input'!P75,'Data Input'!V75,'Data Input'!W75))","v":""},{"$f":"IF(M70=\"\",\"\",M70/COUNTIF('Data Input'!$C$8:$AA$8,\"÷\"))","v":""},{"$f":"IF(ISBLANK('Data Input'!A75),\"\",SUM('Data Input'!T75,'Data Input'!X75,'Data Input'!Z75,'Data Input'!AA75))","v":""},{"$f":"IF(O70=\"\",\"\",O70/COUNTIF('Data Input'!$C$8:$AA$8,\"F\"))","v":""}]
[{"$f":"IF('Data Input'!A76=0,\"\",'Data Input'!A76)","v":""},{"$f":"IF(ISBLANK('Data Input'!A76),\"\",COUNTIF('Data Input'!C76:AA76,\"\"))","v":""},{"$f":"IF(ISBLANK('Data Input'!A76),\"\",COUNTIF('Data Input'!C76:AA76,\"0\"))","v":""},{"$f":"IF(ISBLANK('Data Input'!A76),\"\",SUM(B71,C71))","v":""},{"$f":"IF(ISBLANK('Data Input'!A76),\"\",SUM('Data Input'!C76:AA76))","v":""},{"$f":"IF(E71=\"\",\"\",E71/(COUNTA('Data Input'!$C$8:$AA$8)))","v":""},{"$f":"IF(ISBLANK('Data Input'!A76),\"\",SUM('Data Input'!C76,'Data Input'!F76,'Data Input'!G76,'Data Input'!J76,'Data Input'!L76,'Data Input'!O76,'Data Input'!Q76,'Data Input'!R76,'Data Input'!U76))","v":""},{"$f":"IF(G71=\"\",\"\",G71/COUNTIF('Data Input'!$C$8:$AA$8,\"+\"))","v":""},{"$f":"IF(ISBLANK('Data Input'!A76),\"\",SUM('Data Input'!D76,'Data Input'!E76,'Data Input'!K76,'Data Input'!M76,'Data Input'!Y76))","v":""},{"$f":"IF(I71=\"\",\"\",I71/COUNTIF('Data Input'!$C$8:$AA$8,\"-\"))","v":""},{"$f":"IF(ISBLANK('Data Input'!A76),\"\",SUM('Data Input'!H76,'Data Input'!I76,'Data Input'!N76,'Data Input'!S76))","v":""},{"$f":"IF(K71=\"\",\"\",K71/COUNTIF('Data Input'!$C$8:$AA$8,\"x\"))","v":""},{"$f":"IF(ISBLANK('Data Input'!A76),\"\",SUM('Data Input'!P76,'Data Input'!V76,'Data Input'!W76))","v":""},{"$f":"IF(M71=\"\",\"\",M71/COUNTIF('Data Input'!$C$8:$AA$8,\"÷\"))","v":""},{"$f":"IF(ISBLANK('Data Input'!A76),\"\",SUM('Data Input'!T76,'Data Input'!X76,'Data Input'!Z76,'Data Input'!AA76))","v":""},{"$f":"IF(O71=\"\",\"\",O71/COUNTIF('Data Input'!$C$8:$AA$8,\"F\"))","v":""}]
[{"$f":"IF('Data Input'!A77=0,\"\",'Data Input'!A77)","v":""},{"$f":"IF(ISBLANK('Data Input'!A77),\"\",COUNTIF('Data Input'!C77:AA77,\"\"))","v":""},{"$f":"IF(ISBLANK('Data Input'!A77),\"\",COUNTIF('Data Input'!C77:AA77,\"0\"))","v":""},{"$f":"IF(ISBLANK('Data Input'!A77),\"\",SUM(B72,C72))","v":""},{"$f":"IF(ISBLANK('Data Input'!A77),\"\",SUM('Data Input'!C77:AA77))","v":""},{"$f":"IF(E72=\"\",\"\",E72/(COUNTA('Data Input'!$C$8:$AA$8)))","v":""},{"$f":"IF(ISBLANK('Data Input'!A77),\"\",SUM('Data Input'!C77,'Data Input'!F77,'Data Input'!G77,'Data Input'!J77,'Data Input'!L77,'Data Input'!O77,'Data Input'!Q77,'Data Input'!R77,'Data Input'!U77))","v":""},{"$f":"IF(G72=\"\",\"\",G72/COUNTIF('Data Input'!$C$8:$AA$8,\"+\"))","v":""},{"$f":"IF(ISBLANK('Data Input'!A77),\"\",SUM('Data Input'!D77,'Data Input'!E77,'Data Input'!K77,'Data Input'!M77,'Data Input'!Y77))","v":""},{"$f":"IF(I72=\"\",\"\",I72/COUNTIF('Data Input'!$C$8:$AA$8,\"-\"))","v":""},{"$f":"IF(ISBLANK('Data Input'!A77),\"\",SUM('Data Input'!H77,'Data Input'!I77,'Data Input'!N77,'Data Input'!S77))","v":""},{"$f":"IF(K72=\"\",\"\",K72/COUNTIF('Data Input'!$C$8:$AA$8,\"x\"))","v":""},{"$f":"IF(ISBLANK('Data Input'!A77),\"\",SUM('Data Input'!P77,'Data Input'!V77,'Data Input'!W77))","v":""},{"$f":"IF(M72=\"\",\"\",M72/COUNTIF('Data Input'!$C$8:$AA$8,\"÷\"))","v":""},{"$f":"IF(ISBLANK('Data Input'!A77),\"\",SUM('Data Input'!T77,'Data Input'!X77,'Data Input'!Z77,'Data Input'!AA77))","v":""},{"$f":"IF(O72=\"\",\"\",O72/COUNTIF('Data Input'!$C$8:$AA$8,\"F\"))","v":""}]
[{"$f":"IF('Data Input'!A78=0,\"\",'Data Input'!A78)","v":""},{"$f":"IF(ISBLANK('Data Input'!A78),\"\",COUNTIF('Data Input'!C78:AA78,\"\"))","v":""},{"$f":"IF(ISBLANK('Data Input'!A78),\"\",COUNTIF('Data Input'!C78:AA78,\"0\"))","v":""},{"$f":"IF(ISBLANK('Data Input'!A78),\"\",SUM(B73,C73))","v":""},{"$f":"IF(ISBLANK('Data Input'!A78),\"\",SUM('Data Input'!C78:AA78))","v":""},{"$f":"IF(E73=\"\",\"\",E73/(COUNTA('Data Input'!$C$8:$AA$8)))","v":""},{"$f":"IF(ISBLANK('Data Input'!A78),\"\",SUM('Data Input'!C78,'Data Input'!F78,'Data Input'!G78,'Data Input'!J78,'Data Input'!L78,'Data Input'!O78,'Data Input'!Q78,'Data Input'!R78,'Data Input'!U78))","v":""},{"$f":"IF(G73=\"\",\"\",G73/COUNTIF('Data Input'!$C$8:$AA$8,\"+\"))","v":""},{"$f":"IF(ISBLANK('Data Input'!A78),\"\",SUM('Data Input'!D78,'Data Input'!E78,'Data Input'!K78,'Data Input'!M78,'Data Input'!Y78))","v":""},{"$f":"IF(I73=\"\",\"\",I73/COUNTIF('Data Input'!$C$8:$AA$8,\"-\"))","v":""},{"$f":"IF(ISBLANK('Data Input'!A78),\"\",SUM('Data Input'!H78,'Data Input'!I78,'Data Input'!N78,'Data Input'!S78))","v":""},{"$f":"IF(K73=\"\",\"\",K73/COUNTIF('Data Input'!$C$8:$AA$8,\"x\"))","v":""},{"$f":"IF(ISBLANK('Data Input'!A78),\"\",SUM('Data Input'!P78,'Data Input'!V78,'Data Input'!W78))","v":""},{"$f":"IF(M73=\"\",\"\",M73/COUNTIF('Data Input'!$C$8:$AA$8,\"÷\"))","v":""},{"$f":"IF(ISBLANK('Data Input'!A78),\"\",SUM('Data Input'!T78,'Data Input'!X78,'Data Input'!Z78,'Data Input'!AA78))","v":""},{"$f":"IF(O73=\"\",\"\",O73/COUNTIF('Data Input'!$C$8:$AA$8,\"F\"))","v":""}]
[{"$f":"IF('Data Input'!A79=0,\"\",'Data Input'!A79)","v":""},{"$f":"IF(ISBLANK('Data Input'!A79),\"\",COUNTIF('Data Input'!C79:AA79,\"\"))","v":""},{"$f":"IF(ISBLANK('Data Input'!A79),\"\",COUNTIF('Data Input'!C79:AA79,\"0\"))","v":""},{"$f":"IF(ISBLANK('Data Input'!A79),\"\",SUM(B74,C74))","v":""},{"$f":"IF(ISBLANK('Data Input'!A79),\"\",SUM('Data Input'!C79:AA79))","v":""},{"$f":"IF(E74=\"\",\"\",E74/(COUNTA('Data Input'!$C$8:$AA$8)))","v":""},{"$f":"IF(ISBLANK('Data Input'!A79),\"\",SUM('Data Input'!C79,'Data Input'!F79,'Data Input'!G79,'Data Input'!J79,'Data Input'!L79,'Data Input'!O79,'Data Input'!Q79,'Data Input'!R79,'Data Input'!U79))","v":""},{"$f":"IF(G74=\"\",\"\",G74/COUNTIF('Data Input'!$C$8:$AA$8,\"+\"))","v":""},{"$f":"IF(ISBLANK('Data Input'!A79),\"\",SUM('Data Input'!D79,'Data Input'!E79,'Data Input'!K79,'Data Input'!M79,'Data Input'!Y79))","v":""},{"$f":"IF(I74=\"\",\"\",I74/COUNTIF('Data Input'!$C$8:$AA$8,\"-\"))","v":""},{"$f":"IF(ISBLANK('Data Input'!A79),\"\",SUM('Data Input'!H79,'Data Input'!I79,'Data Input'!N79,'Data Input'!S79))","v":""},{"$f":"IF(K74=\"\",\"\",K74/COUNTIF('Data Input'!$C$8:$AA$8,\"x\"))","v":""},{"$f":"IF(ISBLANK('Data Input'!A79),\"\",SUM('Data Input'!P79,'Data Input'!V79,'Data Input'!W79))","v":""},{"$f":"IF(M74=\"\",\"\",M74/COUNTIF('Data Input'!$C$8:$AA$8,\"÷\"))","v":""},{"$f":"IF(ISBLANK('Data Input'!A79),\"\",SUM('Data Input'!T79,'Data Input'!X79,'Data Input'!Z79,'Data Input'!AA79))","v":""},{"$f":"IF(O74=\"\",\"\",O74/COUNTIF('Data Input'!$C$8:$AA$8,\"F\"))","v":""}]
[{"$f":"IF('Data Input'!A80=0,\"\",'Data Input'!A80)","v":""},{"$f":"IF(ISBLANK('Data Input'!A80),\"\",COUNTIF('Data Input'!C80:AA80,\"\"))","v":""},{"$f":"IF(ISBLANK('Data Input'!A80),\"\",COUNTIF('Data Input'!C80:AA80,\"0\"))","v":""},{"$f":"IF(ISBLANK('Data Input'!A80),\"\",SUM(B75,C75))","v":""},{"$f":"IF(ISBLANK('Data Input'!A80),\"\",SUM('Data Input'!C80:AA80))","v":""},{"$f":"IF(E75=\"\",\"\",E75/(COUNTA('Data Input'!$C$8:$AA$8)))","v":""},{"$f":"IF(ISBLANK('Data Input'!A80),\"\",SUM('Data Input'!C80,'Data Input'!F80,'Data Input'!G80,'Data Input'!J80,'Data Input'!L80,'Data Input'!O80,'Data Input'!Q80,'Data Input'!R80,'Data Input'!U80))","v":""},{"$f":"IF(G75=\"\",\"\",G75/COUNTIF('Data Input'!$C$8:$AA$8,\"+\"))","v":""},{"$f":"IF(ISBLANK('Data Input'!A80),\"\",SUM('Data Input'!D80,'Data Input'!E80,'Data Input'!K80,'Data Input'!M80,'Data Input'!Y80))","v":""},{"$f":"IF(I75=\"\",\"\",I75/COUNTIF('Data Input'!$C$8:$AA$8,\"-\"))","v":""},{"$f":"IF(ISBLANK('Data Input'!A80),\"\",SUM('Data Input'!H80,'Data Input'!I80,'Data Input'!N80,'Data Input'!S80))","v":""},{"$f":"IF(K75=\"\",\"\",K75/COUNTIF('Data Input'!$C$8:$AA$8,\"x\"))","v":""},{"$f":"IF(ISBLANK('Data Input'!A80),\"\",SUM('Data Input'!P80,'Data Input'!V80,'Data Input'!W80))","v":""},{"$f":"IF(M75=\"\",\"\",M75/COUNTIF('Data Input'!$C$8:$AA$8,\"÷\"))","v":""},{"$f":"IF(ISBLANK('Data Input'!A80),\"\",SUM('Data Input'!T80,'Data Input'!X80,'Data Input'!Z80,'Data Input'!AA80))","v":""},{"$f":"IF(O75=\"\",\"\",O75/COUNTIF('Data Input'!$C$8:$AA$8,\"F\"))","v":""}]
[{"$f":"IF('Data Input'!A81=0,\"\",'Data Input'!A81)","v":""},{"$f":"IF(ISBLANK('Data Input'!A81),\"\",COUNTIF('Data Input'!C81:AA81,\"\"))","v":""},{"$f":"IF(ISBLANK('Data Input'!A81),\"\",COUNTIF('Data Input'!C81:AA81,\"0\"))","v":""},{"$f":"IF(ISBLANK('Data Input'!A81),\"\",SUM(B76,C76))","v":""},{"$f":"IF(ISBLANK('Data Input'!A81),\"\",SUM('Data Input'!C81:AA81))","v":""},{"$f":"IF(E76=\"\",\"\",E76/(COUNTA('Data Input'!$C$8:$AA$8)))","v":""},{"$f":"IF(ISBLANK('Data Input'!A81),\"\",SUM('Data Input'!C81,'Data Input'!F81,'Data Input'!G81,'Data Input'!J81,'Data Input'!L81,'Data Input'!O81,'Data Input'!Q81,'Data Input'!R81,'Data Input'!U81))","v":""},{"$f":"IF(G76=\"\",\"\",G76/COUNTIF('Data Input'!$C$8:$AA$8,\"+\"))","v":""},{"$f":"IF(ISBLANK('Data Input'!A81),\"\",SUM('Data Input'!D81,'Data Input'!E81,'Data Input'!K81,'Data Input'!M81,'Data Input'!Y81))","v":""},{"$f":"IF(I76=\"\",\"\",I76/COUNTIF('Data Input'!$C$8:$AA$8,\"-\"))","v":""},{"$f":"IF(ISBLANK('Data Input'!A81),\"\",SUM('Data Input'!H81,'Data Input'!I81,'Data Input'!N81,'Data Input'!S81))","v":""},{"$f":"IF(K76=\"\",\"\",K76/COUNTIF('Data Input'!$C$8:$AA$8,\"x\"))","v":""},{"$f":"IF(ISBLANK('Data Input'!A81),\"\",SUM('Data Input'!P81,'Data Input'!V81,'Data Input'!W81))","v":""},{"$f":"IF(M76=\"\",\"\",M76/COUNTIF('Data Input'!$C$8:$AA$8,\"÷\"))","v":""},{"$f":"IF(ISBLANK('Data Input'!A81),\"\",SUM('Data Input'!T81,'Data Input'!X81,'Data Input'!Z81,'Data Input'!AA81))","v":""},{"$f":"IF(O76=\"\",\"\",O76/COUNTIF('Data Input'!$C$8:$AA$8,\"F\"))","v":""}]
[{"$f":"IF('Data Input'!A82=0,\"\",'Data Input'!A82)","v":""},{"$f":"IF(ISBLANK('Data Input'!A82),\"\",COUNTIF('Data Input'!C82:AA82,\"\"))","v":""},{"$f":"IF(ISBLANK('Data Input'!A82),\"\",COUNTIF('Data Input'!C82:AA82,\"0\"))","v":""},{"$f":"IF(ISBLANK('Data Input'!A82),\"\",SUM(B77,C77))","v":""},{"$f":"IF(ISBLANK('Data Input'!A82),\"\",SUM('Data Input'!C82:AA82))","v":""},{"$f":"IF(E77=\"\",\"\",E77/(COUNTA('Data Input'!$C$8:$AA$8)))","v":""},{"$f":"IF(ISBLANK('Data Input'!A82),\"\",SUM('Data Input'!C82,'Data Input'!F82,'Data Input'!G82,'Data Input'!J82,'Data Input'!L82,'Data Input'!O82,'Data Input'!Q82,'Data Input'!R82,'Data Input'!U82))","v":""},{"$f":"IF(G77=\"\",\"\",G77/COUNTIF('Data Input'!$C$8:$AA$8,\"+\"))","v":""},{"$f":"IF(ISBLANK('Data Input'!A82),\"\",SUM('Data Input'!D82,'Data Input'!E82,'Data Input'!K82,'Data Input'!M82,'Data Input'!Y82))","v":""},{"$f":"IF(I77=\"\",\"\",I77/COUNTIF('Data Input'!$C$8:$AA$8,\"-\"))","v":""},{"$f":"IF(ISBLANK('Data Input'!A82),\"\",SUM('Data Input'!H82,'Data Input'!I82,'Data Input'!N82,'Data Input'!S82))","v":""},{"$f":"IF(K77=\"\",\"\",K77/COUNTIF('Data Input'!$C$8:$AA$8,\"x\"))","v":""},{"$f":"IF(ISBLANK('Data Input'!A82),\"\",SUM('Data Input'!P82,'Data Input'!V82,'Data Input'!W82))","v":""},{"$f":"IF(M77=\"\",\"\",M77/COUNTIF('Data Input'!$C$8:$AA$8,\"÷\"))","v":""},{"$f":"IF(ISBLANK('Data Input'!A82),\"\",SUM('Data Input'!T82,'Data Input'!X82,'Data Input'!Z82,'Data Input'!AA82))","v":""},{"$f":"IF(O77=\"\",\"\",O77/COUNTIF('Data Input'!$C$8:$AA$8,\"F\"))","v":""}]
[{"$f":"IF('Data Input'!A83=0,\"\",'Data Input'!A83)","v":""},{"$f":"IF(ISBLANK('Data Input'!A83),\"\",COUNTIF('Data Input'!C83:AA83,\"\"))","v":""},{"$f":"IF(ISBLANK('Data Input'!A83),\"\",COUNTIF('Data Input'!C83:AA83,\"0\"))","v":""},{"$f":"IF(ISBLANK('Data Input'!A83),\"\",SUM(B78,C78))","v":""},{"$f":"IF(ISBLANK('Data Input'!A83),\"\",SUM('Data Input'!C83:AA83))","v":""},{"$f":"IF(E78=\"\",\"\",E78/(COUNTA('Data Input'!$C$8:$AA$8)))","v":""},{"$f":"IF(ISBLANK('Data Input'!A83),\"\",SUM('Data Input'!C83,'Data Input'!F83,'Data Input'!G83,'Data Input'!J83,'Data Input'!L83,'Data Input'!O83,'Data Input'!Q83,'Data Input'!R83,'Data Input'!U83))","v":""},{"$f":"IF(G78=\"\",\"\",G78/COUNTIF('Data Input'!$C$8:$AA$8,\"+\"))","v":""},{"$f":"IF(ISBLANK('Data Input'!A83),\"\",SUM('Data Input'!D83,'Data Input'!E83,'Data Input'!K83,'Data Input'!M83,'Data Input'!Y83))","v":""},{"$f":"IF(I78=\"\",\"\",I78/COUNTIF('Data Input'!$C$8:$AA$8,\"-\"))","v":""},{"$f":"IF(ISBLANK('Data Input'!A83),\"\",SUM('Data Input'!H83,'Data Input'!I83,'Data Input'!N83,'Data Input'!S83))","v":""},{"$f":"IF(K78=\"\",\"\",K78/COUNTIF('Data Input'!$C$8:$AA$8,\"x\"))","v":""},{"$f":"IF(ISBLANK('Data Input'!A83),\"\",SUM('Data Input'!P83,'Data Input'!V83,'Data Input'!W83))","v":""},{"$f":"IF(M78=\"\",\"\",M78/COUNTIF('Data Input'!$C$8:$AA$8,\"÷\"))","v":""},{"$f":"IF(ISBLANK('Data Input'!A83),\"\",SUM('Data Input'!T83,'Data Input'!X83,'Data Input'!Z83,'Data Input'!AA83))","v":""},{"$f":"IF(O78=\"\",\"\",O78/COUNTIF('Data Input'!$C$8:$AA$8,\"F\"))","v":""}]
[{"$f":"IF('Data Input'!A84=0,\"\",'Data Input'!A84)","v":""},{"$f":"IF(ISBLANK('Data Input'!A84),\"\",COUNTIF('Data Input'!C84:AA84,\"\"))","v":""},{"$f":"IF(ISBLANK('Data Input'!A84),\"\",COUNTIF('Data Input'!C84:AA84,\"0\"))","v":""},{"$f":"IF(ISBLANK('Data Input'!A84),\"\",SUM(B79,C79))","v":""},{"$f":"IF(ISBLANK('Data Input'!A84),\"\",SUM('Data Input'!C84:AA84))","v":""},{"$f":"IF(E79=\"\",\"\",E79/(COUNTA('Data Input'!$C$8:$AA$8)))","v":""},{"$f":"IF(ISBLANK('Data Input'!A84),\"\",SUM('Data Input'!C84,'Data Input'!F84,'Data Input'!G84,'Data Input'!J84,'Data Input'!L84,'Data Input'!O84,'Data Input'!Q84,'Data Input'!R84,'Data Input'!U84))","v":""},{"$f":"IF(G79=\"\",\"\",G79/COUNTIF('Data Input'!$C$8:$AA$8,\"+\"))","v":""},{"$f":"IF(ISBLANK('Data Input'!A84),\"\",SUM('Data Input'!D84,'Data Input'!E84,'Data Input'!K84,'Data Input'!M84,'Data Input'!Y84))","v":""},{"$f":"IF(I79=\"\",\"\",I79/COUNTIF('Data Input'!$C$8:$AA$8,\"-\"))","v":""},{"$f":"IF(ISBLANK('Data Input'!A84),\"\",SUM('Data Input'!H84,'Data Input'!I84,'Data Input'!N84,'Data Input'!S84))","v":""},{"$f":"IF(K79=\"\",\"\",K79/COUNTIF('Data Input'!$C$8:$AA$8,\"x\"))","v":""},{"$f":"IF(ISBLANK('Data Input'!A84),\"\",SUM('Data Input'!P84,'Data Input'!V84,'Data Input'!W84))","v":""},{"$f":"IF(M79=\"\",\"\",M79/COUNTIF('Data Input'!$C$8:$AA$8,\"÷\"))","v":""},{"$f":"IF(ISBLANK('Data Input'!A84),\"\",SUM('Data Input'!T84,'Data Input'!X84,'Data Input'!Z84,'Data Input'!AA84))","v":""},{"$f":"IF(O79=\"\",\"\",O79/COUNTIF('Data Input'!$C$8:$AA$8,\"F\"))","v":""}]
[{"$f":"IF('Data Input'!A85=0,\"\",'Data Input'!A85)","v":""},{"$f":"IF(ISBLANK('Data Input'!A85),\"\",COUNTIF('Data Input'!C85:AA85,\"\"))","v":""},{"$f":"IF(ISBLANK('Data Input'!A85),\"\",COUNTIF('Data Input'!C85:AA85,\"0\"))","v":""},{"$f":"IF(ISBLANK('Data Input'!A85),\"\",SUM(B80,C80))","v":""},{"$f":"IF(ISBLANK('Data Input'!A85),\"\",SUM('Data Input'!C85:AA85))","v":""},{"$f":"IF(E80=\"\",\"\",E80/(COUNTA('Data Input'!$C$8:$AA$8)))","v":""},{"$f":"IF(ISBLANK('Data Input'!A85),\"\",SUM('Data Input'!C85,'Data Input'!F85,'Data Input'!G85,'Data Input'!J85,'Data Input'!L85,'Data Input'!O85,'Data Input'!Q85,'Data Input'!R85,'Data Input'!U85))","v":""},{"$f":"IF(G80=\"\",\"\",G80/COUNTIF('Data Input'!$C$8:$AA$8,\"+\"))","v":""},{"$f":"IF(ISBLANK('Data Input'!A85),\"\",SUM('Data Input'!D85,'Data Input'!E85,'Data Input'!K85,'Data Input'!M85,'Data Input'!Y85))","v":""},{"$f":"IF(I80=\"\",\"\",I80/COUNTIF('Data Input'!$C$8:$AA$8,\"-\"))","v":""},{"$f":"IF(ISBLANK('Data Input'!A85),\"\",SUM('Data Input'!H85,'Data Input'!I85,'Data Input'!N85,'Data Input'!S85))","v":""},{"$f":"IF(K80=\"\",\"\",K80/COUNTIF('Data Input'!$C$8:$AA$8,\"x\"))","v":""},{"$f":"IF(ISBLANK('Data Input'!A85),\"\",SUM('Data Input'!P85,'Data Input'!V85,'Data Input'!W85))","v":""},{"$f":"IF(M80=\"\",\"\",M80/COUNTIF('Data Input'!$C$8:$AA$8,\"÷\"))","v":""},{"$f":"IF(ISBLANK('Data Input'!A85),\"\",SUM('Data Input'!T85,'Data Input'!X85,'Data Input'!Z85,'Data Input'!AA85))","v":""},{"$f":"IF(O80=\"\",\"\",O80/COUNTIF('Data Input'!$C$8:$AA$8,\"F\"))","v":""}]
[{"$f":"IF('Data Input'!A86=0,\"\",'Data Input'!A86)","v":""},{"$f":"IF(ISBLANK('Data Input'!A86),\"\",COUNTIF('Data Input'!C86:AA86,\"\"))","v":""},{"$f":"IF(ISBLANK('Data Input'!A86),\"\",COUNTIF('Data Input'!C86:AA86,\"0\"))","v":""},{"$f":"IF(ISBLANK('Data Input'!A86),\"\",SUM(B81,C81))","v":""},{"$f":"IF(ISBLANK('Data Input'!A86),\"\",SUM('Data Input'!C86:AA86))","v":""},{"$f":"IF(E81=\"\",\"\",E81/(COUNTA('Data Input'!$C$8:$AA$8)))","v":""},{"$f":"IF(ISBLANK('Data Input'!A86),\"\",SUM('Data Input'!C86,'Data Input'!F86,'Data Input'!G86,'Data Input'!J86,'Data Input'!L86,'Data Input'!O86,'Data Input'!Q86,'Data Input'!R86,'Data Input'!U86))","v":""},{"$f":"IF(G81=\"\",\"\",G81/COUNTIF('Data Input'!$C$8:$AA$8,\"+\"))","v":""},{"$f":"IF(ISBLANK('Data Input'!A86),\"\",SUM('Data Input'!D86,'Data Input'!E86,'Data Input'!K86,'Data Input'!M86,'Data Input'!Y86))","v":""},{"$f":"IF(I81=\"\",\"\",I81/COUNTIF('Data Input'!$C$8:$AA$8,\"-\"))","v":""},{"$f":"IF(ISBLANK('Data Input'!A86),\"\",SUM('Data Input'!H86,'Data Input'!I86,'Data Input'!N86,'Data Input'!S86))","v":""},{"$f":"IF(K81=\"\",\"\",K81/COUNTIF('Data Input'!$C$8:$AA$8,\"x\"))","v":""},{"$f":"IF(ISBLANK('Data Input'!A86),\"\",SUM('Data Input'!P86,'Data Input'!V86,'Data Input'!W86))","v":""},{"$f":"IF(M81=\"\",\"\",M81/COUNTIF('Data Input'!$C$8:$AA$8,\"÷\"))","v":""},{"$f":"IF(ISBLANK('Data Input'!A86),\"\",SUM('Data Input'!T86,'Data Input'!X86,'Data Input'!Z86,'Data Input'!AA86))","v":""},{"$f":"IF(O81=\"\",\"\",O81/COUNTIF('Data Input'!$C$8:$AA$8,\"F\"))","v":""}]
[{"$f":"IF('Data Input'!A87=0,\"\",'Data Input'!A87)","v":""},{"$f":"IF(ISBLANK('Data Input'!A87),\"\",COUNTIF('Data Input'!C87:AA87,\"\"))","v":""},{"$f":"IF(ISBLANK('Data Input'!A87),\"\",COUNTIF('Data Input'!C87:AA87,\"0\"))","v":""},{"$f":"IF(ISBLANK('Data Input'!A87),\"\",SUM(B82,C82))","v":""},{"$f":"IF(ISBLANK('Data Input'!A87),\"\",SUM('Data Input'!C87:AA87))","v":""},{"$f":"IF(E82=\"\",\"\",E82/(COUNTA('Data Input'!$C$8:$AA$8)))","v":""},{"$f":"IF(ISBLANK('Data Input'!A87),\"\",SUM('Data Input'!C87,'Data Input'!F87,'Data Input'!G87,'Data Input'!J87,'Data Input'!L87,'Data Input'!O87,'Data Input'!Q87,'Data Input'!R87,'Data Input'!U87))","v":""},{"$f":"IF(G82=\"\",\"\",G82/COUNTIF('Data Input'!$C$8:$AA$8,\"+\"))","v":""},{"$f":"IF(ISBLANK('Data Input'!A87),\"\",SUM('Data Input'!D87,'Data Input'!E87,'Data Input'!K87,'Data Input'!M87,'Data Input'!Y87))","v":""},{"$f":"IF(I82=\"\",\"\",I82/COUNTIF('Data Input'!$C$8:$AA$8,\"-\"))","v":""},{"$f":"IF(ISBLANK('Data Input'!A87),\"\",SUM('Data Input'!H87,'Data Input'!I87,'Data Input'!N87,'Data Input'!S87))","v":""},{"$f":"IF(K82=\"\",\"\",K82/COUNTIF('Data Input'!$C$8:$AA$8,\"x\"))","v":""},{"$f":"IF(ISBLANK('Data Input'!A87),\"\",SUM('Data Input'!P87,'Data Input'!V87,'Data Input'!W87))","v":""},{"$f":"IF(M82=\"\",\"\",M82/COUNTIF('Data Input'!$C$8:$AA$8,\"÷\"))","v":""},{"$f":"IF(ISBLANK('Data Input'!A87),\"\",SUM('Data Input'!T87,'Data Input'!X87,'Data Input'!Z87,'Data Input'!AA87))","v":""},{"$f":"IF(O82=\"\",\"\",O82/COUNTIF('Data Input'!$C$8:$AA$8,\"F\"))","v":""}]
[{"$f":"IF('Data Input'!A88=0,\"\",'Data Input'!A88)","v":""},{"$f":"IF(ISBLANK('Data Input'!A88),\"\",COUNTIF('Data Input'!C88:AA88,\"\"))","v":""},{"$f":"IF(ISBLANK('Data Input'!A88),\"\",COUNTIF('Data Input'!C88:AA88,\"0\"))","v":""},{"$f":"IF(ISBLANK('Data Input'!A88),\"\",SUM(B83,C83))","v":""},{"$f":"IF(ISBLANK('Data Input'!A88),\"\",SUM('Data Input'!C88:AA88))","v":""},{"$f":"IF(E83=\"\",\"\",E83/(COUNTA('Data Input'!$C$8:$AA$8)))","v":""},{"$f":"IF(ISBLANK('Data Input'!A88),\"\",SUM('Data Input'!C88,'Data Input'!F88,'Data Input'!G88,'Data Input'!J88,'Data Input'!L88,'Data Input'!O88,'Data Input'!Q88,'Data Input'!R88,'Data Input'!U88))","v":""},{"$f":"IF(G83=\"\",\"\",G83/COUNTIF('Data Input'!$C$8:$AA$8,\"+\"))","v":""},{"$f":"IF(ISBLANK('Data Input'!A88),\"\",SUM('Data Input'!D88,'Data Input'!E88,'Data Input'!K88,'Data Input'!M88,'Data Input'!Y88))","v":""},{"$f":"IF(I83=\"\",\"\",I83/COUNTIF('Data Input'!$C$8:$AA$8,\"-\"))","v":""},{"$f":"IF(ISBLANK('Data Input'!A88),\"\",SUM('Data Input'!H88,'Data Input'!I88,'Data Input'!N88,'Data Input'!S88))","v":""},{"$f":"IF(K83=\"\",\"\",K83/COUNTIF('Data Input'!$C$8:$AA$8,\"x\"))","v":""},{"$f":"IF(ISBLANK('Data Input'!A88),\"\",SUM('Data Input'!P88,'Data Input'!V88,'Data Input'!W88))","v":""},{"$f":"IF(M83=\"\",\"\",M83/COUNTIF('Data Input'!$C$8:$AA$8,\"÷\"))","v":""},{"$f":"IF(ISBLANK('Data Input'!A88),\"\",SUM('Data Input'!T88,'Data Input'!X88,'Data Input'!Z88,'Data Input'!AA88))","v":""},{"$f":"IF(O83=\"\",\"\",O83/COUNTIF('Data Input'!$C$8:$AA$8,\"F\"))","v":""}]
[{"$f":"IF('Data Input'!A89=0,\"\",'Data Input'!A89)","v":""},{"$f":"IF(ISBLANK('Data Input'!A89),\"\",COUNTIF('Data Input'!C89:AA89,\"\"))","v":""},{"$f":"IF(ISBLANK('Data Input'!A89),\"\",COUNTIF('Data Input'!C89:AA89,\"0\"))","v":""},{"$f":"IF(ISBLANK('Data Input'!A89),\"\",SUM(B84,C84))","v":""},{"$f":"IF(ISBLANK('Data Input'!A89),\"\",SUM('Data Input'!C89:AA89))","v":""},{"$f":"IF(E84=\"\",\"\",E84/(COUNTA('Data Input'!$C$8:$AA$8)))","v":""},{"$f":"IF(ISBLANK('Data Input'!A89),\"\",SUM('Data Input'!C89,'Data Input'!F89,'Data Input'!G89,'Data Input'!J89,'Data Input'!L89,'Data Input'!O89,'Data Input'!Q89,'Data Input'!R89,'Data Input'!U89))","v":""},{"$f":"IF(G84=\"\",\"\",G84/COUNTIF('Data Input'!$C$8:$AA$8,\"+\"))","v":""},{"$f":"IF(ISBLANK('Data Input'!A89),\"\",SUM('Data Input'!D89,'Data Input'!E89,'Data Input'!K89,'Data Input'!M89,'Data Input'!Y89))","v":""},{"$f":"IF(I84=\"\",\"\",I84/COUNTIF('Data Input'!$C$8:$AA$8,\"-\"))","v":""},{"$f":"IF(ISBLANK('Data Input'!A89),\"\",SUM('Data Input'!H89,'Data Input'!I89,'Data Input'!N89,'Data Input'!S89))","v":""},{"$f":"IF(K84=\"\",\"\",K84/COUNTIF('Data Input'!$C$8:$AA$8,\"x\"))","v":""},{"$f":"IF(ISBLANK('Data Input'!A89),\"\",SUM('Data Input'!P89,'Data Input'!V89,'Data Input'!W89))","v":""},{"$f":"IF(M84=\"\",\"\",M84/COUNTIF('Data Input'!$C$8:$AA$8,\"÷\"))","v":""},{"$f":"IF(ISBLANK('Data Input'!A89),\"\",SUM('Data Input'!T89,'Data Input'!X89,'Data Input'!Z89,'Data Input'!AA89))","v":""},{"$f":"IF(O84=\"\",\"\",O84/COUNTIF('Data Input'!$C$8:$AA$8,\"F\"))","v":""}]
[{"$f":"IF('Data Input'!A90=0,\"\",'Data Input'!A90)","v":""},{"$f":"IF(ISBLANK('Data Input'!A90),\"\",COUNTIF('Data Input'!C90:AA90,\"\"))","v":""},{"$f":"IF(ISBLANK('Data Input'!A90),\"\",COUNTIF('Data Input'!C90:AA90,\"0\"))","v":""},{"$f":"IF(ISBLANK('Data Input'!A90),\"\",SUM(B85,C85))","v":""},{"$f":"IF(ISBLANK('Data Input'!A90),\"\",SUM('Data Input'!C90:AA90))","v":""},{"$f":"IF(E85=\"\",\"\",E85/(COUNTA('Data Input'!$C$8:$AA$8)))","v":""},{"$f":"IF(ISBLANK('Data Input'!A90),\"\",SUM('Data Input'!C90,'Data Input'!F90,'Data Input'!G90,'Data Input'!J90,'Data Input'!L90,'Data Input'!O90,'Data Input'!Q90,'Data Input'!R90,'Data Input'!U90))","v":""},{"$f":"IF(G85=\"\",\"\",G85/COUNTIF('Data Input'!$C$8:$AA$8,\"+\"))","v":""},{"$f":"IF(ISBLANK('Data Input'!A90),\"\",SUM('Data Input'!D90,'Data Input'!E90,'Data Input'!K90,'Data Input'!M90,'Data Input'!Y90))","v":""},{"$f":"IF(I85=\"\",\"\",I85/COUNTIF('Data Input'!$C$8:$AA$8,\"-\"))","v":""},{"$f":"IF(ISBLANK('Data Input'!A90),\"\",SUM('Data Input'!H90,'Data Input'!I90,'Data Input'!N90,'Data Input'!S90))","v":""},{"$f":"IF(K85=\"\",\"\",K85/COUNTIF('Data Input'!$C$8:$AA$8,\"x\"))","v":""},{"$f":"IF(ISBLANK('Data Input'!A90),\"\",SUM('Data Input'!P90,'Data Input'!V90,'Data Input'!W90))","v":""},{"$f":"IF(M85=\"\",\"\",M85/COUNTIF('Data Input'!$C$8:$AA$8,\"÷\"))","v":""},{"$f":"IF(ISBLANK('Data Input'!A90),\"\",SUM('Data Input'!T90,'Data Input'!X90,'Data Input'!Z90,'Data Input'!AA90))","v":""},{"$f":"IF(O85=\"\",\"\",O85/COUNTIF('Data Input'!$C$8:$AA$8,\"F\"))","v":""}]
[{"$f":"IF('Data Input'!A91=0,\"\",'Data Input'!A91)","v":""},{"$f":"IF(ISBLANK('Data Input'!A91),\"\",COUNTIF('Data Input'!C91:AA91,\"\"))","v":""},{"$f":"IF(ISBLANK('Data Input'!A91),\"\",COUNTIF('Data Input'!C91:AA91,\"0\"))","v":""},{"$f":"IF(ISBLANK('Data Input'!A91),\"\",SUM(B86,C86))","v":""},{"$f":"IF(ISBLANK('Data Input'!A91),\"\",SUM('Data Input'!C91:AA91))","v":""},{"$f":"IF(E86=\"\",\"\",E86/(COUNTA('Data Input'!$C$8:$AA$8)))","v":""},{"$f":"IF(ISBLANK('Data Input'!A91),\"\",SUM('Data Input'!C91,'Data Input'!F91,'Data Input'!G91,'Data Input'!J91,'Data Input'!L91,'Data Input'!O91,'Data Input'!Q91,'Data Input'!R91,'Data Input'!U91))","v":""},{"$f":"IF(G86=\"\",\"\",G86/COUNTIF('Data Input'!$C$8:$AA$8,\"+\"))","v":""},{"$f":"IF(ISBLANK('Data Input'!A91),\"\",SUM('Data Input'!D91,'Data Input'!E91,'Data Input'!K91,'Data Input'!M91,'Data Input'!Y91))","v":""},{"$f":"IF(I86=\"\",\"\",I86/COUNTIF('Data Input'!$C$8:$AA$8,\"-\"))","v":""},{"$f":"IF(ISBLANK('Data Input'!A91),\"\",SUM('Data Input'!H91,'Data Input'!I91,'Data Input'!N91,'Data Input'!S91))","v":""},{"$f":"IF(K86=\"\",\"\",K86/COUNTIF('Data Input'!$C$8:$AA$8,\"x\"))","v":""},{"$f":"IF(ISBLANK('Data Input'!A91),\"\",SUM('Data Input'!P91,'Data Input'!V91,'Data Input'!W91))","v":""},{"$f":"IF(M86=\"\",\"\",M86/COUNTIF('Data Input'!$C$8:$AA$8,\"÷\"))","v":""},{"$f":"IF(ISBLANK('Data Input'!A91),\"\",SUM('Data Input'!T91,'Data Input'!X91,'Data Input'!Z91,'Data Input'!AA91))","v":""},{"$f":"IF(O86=\"\",\"\",O86/COUNTIF('Data Input'!$C$8:$AA$8,\"F\"))","v":""}]
[{"$f":"IF('Data Input'!A92=0,\"\",'Data Input'!A92)","v":""},{"$f":"IF(ISBLANK('Data Input'!A92),\"\",COUNTIF('Data Input'!C92:AA92,\"\"))","v":""},{"$f":"IF(ISBLANK('Data Input'!A92),\"\",COUNTIF('Data Input'!C92:AA92,\"0\"))","v":""},{"$f":"IF(ISBLANK('Data Input'!A92),\"\",SUM(B87,C87))","v":""},{"$f":"IF(ISBLANK('Data Input'!A92),\"\",SUM('Data Input'!C92:AA92))","v":""},{"$f":"IF(E87=\"\",\"\",E87/(COUNTA('Data Input'!$C$8:$AA$8)))","v":""},{"$f":"IF(ISBLANK('Data Input'!A92),\"\",SUM('Data Input'!C92,'Data Input'!F92,'Data Input'!G92,'Data Input'!J92,'Data Input'!L92,'Data Input'!O92,'Data Input'!Q92,'Data Input'!R92,'Data Input'!U92))","v":""},{"$f":"IF(G87=\"\",\"\",G87/COUNTIF('Data Input'!$C$8:$AA$8,\"+\"))","v":""},{"$f":"IF(ISBLANK('Data Input'!A92),\"\",SUM('Data Input'!D92,'Data Input'!E92,'Data Input'!K92,'Data Input'!M92,'Data Input'!Y92))","v":""},{"$f":"IF(I87=\"\",\"\",I87/COUNTIF('Data Input'!$C$8:$AA$8,\"-\"))","v":""},{"$f":"IF(ISBLANK('Data Input'!A92),\"\",SUM('Data Input'!H92,'Data Input'!I92,'Data Input'!N92,'Data Input'!S92))","v":""},{"$f":"IF(K87=\"\",\"\",K87/COUNTIF('Data Input'!$C$8:$AA$8,\"x\"))","v":""},{"$f":"IF(ISBLANK('Data Input'!A92),\"\",SUM('Data Input'!P92,'Data Input'!V92,'Data Input'!W92))","v":""},{"$f":"IF(M87=\"\",\"\",M87/COUNTIF('Data Input'!$C$8:$AA$8,\"÷\"))","v":""},{"$f":"IF(ISBLANK('Data Input'!A92),\"\",SUM('Data Input'!T92,'Data Input'!X92,'Data Input'!Z92,'Data Input'!AA92))","v":""},{"$f":"IF(O87=\"\",\"\",O87/COUNTIF('Data Input'!$C$8:$AA$8,\"F\"))","v":""}]
[{"$f":"IF('Data Input'!A93=0,\"\",'Data Input'!A93)","v":""},{"$f":"IF(ISBLANK('Data Input'!A93),\"\",COUNTIF('Data Input'!C93:AA93,\"\"))","v":""},{"$f":"IF(ISBLANK('Data Input'!A93),\"\",COUNTIF('Data Input'!C93:AA93,\"0\"))","v":""},{"$f":"IF(ISBLANK('Data Input'!A93),\"\",SUM(B88,C88))","v":""},{"$f":"IF(ISBLANK('Data Input'!A93),\"\",SUM('Data Input'!C93:AA93))","v":""},{"$f":"IF(E88=\"\",\"\",E88/(COUNTA('Data Input'!$C$8:$AA$8)))","v":""},{"$f":"IF(ISBLANK('Data Input'!A93),\"\",SUM('Data Input'!C93,'Data Input'!F93,'Data Input'!G93,'Data Input'!J93,'Data Input'!L93,'Data Input'!O93,'Data Input'!Q93,'Data Input'!R93,'Data Input'!U93))","v":""},{"$f":"IF(G88=\"\",\"\",G88/COUNTIF('Data Input'!$C$8:$AA$8,\"+\"))","v":""},{"$f":"IF(ISBLANK('Data Input'!A93),\"\",SUM('Data Input'!D93,'Data Input'!E93,'Data Input'!K93,'Data Input'!M93,'Data Input'!Y93))","v":""},{"$f":"IF(I88=\"\",\"\",I88/COUNTIF('Data Input'!$C$8:$AA$8,\"-\"))","v":""},{"$f":"IF(ISBLANK('Data Input'!A93),\"\",SUM('Data Input'!H93,'Data Input'!I93,'Data Input'!N93,'Data Input'!S93))","v":""},{"$f":"IF(K88=\"\",\"\",K88/COUNTIF('Data Input'!$C$8:$AA$8,\"x\"))","v":""},{"$f":"IF(ISBLANK('Data Input'!A93),\"\",SUM('Data Input'!P93,'Data Input'!V93,'Data Input'!W93))","v":""},{"$f":"IF(M88=\"\",\"\",M88/COUNTIF('Data Input'!$C$8:$AA$8,\"÷\"))","v":""},{"$f":"IF(ISBLANK('Data Input'!A93),\"\",SUM('Data Input'!T93,'Data Input'!X93,'Data Input'!Z93,'Data Input'!AA93))","v":""},{"$f":"IF(O88=\"\",\"\",O88/COUNTIF('Data Input'!$C$8:$AA$8,\"F\"))","v":""}]
[{"$f":"IF('Data Input'!A94=0,\"\",'Data Input'!A94)","v":""},{"$f":"IF(ISBLANK('Data Input'!A94),\"\",COUNTIF('Data Input'!C94:AA94,\"\"))","v":""},{"$f":"IF(ISBLANK('Data Input'!A94),\"\",COUNTIF('Data Input'!C94:AA94,\"0\"))","v":""},{"$f":"IF(ISBLANK('Data Input'!A94),\"\",SUM(B89,C89))","v":""},{"$f":"IF(ISBLANK('Data Input'!A94),\"\",SUM('Data Input'!C94:AA94))","v":""},{"$f":"IF(E89=\"\",\"\",E89/(COUNTA('Data Input'!$C$8:$AA$8)))","v":""},{"$f":"IF(ISBLANK('Data Input'!A94),\"\",SUM('Data Input'!C94,'Data Input'!F94,'Data Input'!G94,'Data Input'!J94,'Data Input'!L94,'Data Input'!O94,'Data Input'!Q94,'Data Input'!R94,'Data Input'!U94))","v":""},{"$f":"IF(G89=\"\",\"\",G89/COUNTIF('Data Input'!$C$8:$AA$8,\"+\"))","v":""},{"$f":"IF(ISBLANK('Data Input'!A94),\"\",SUM('Data Input'!D94,'Data Input'!E94,'Data Input'!K94,'Data Input'!M94,'Data Input'!Y94))","v":""},{"$f":"IF(I89=\"\",\"\",I89/COUNTIF('Data Input'!$C$8:$AA$8,\"-\"))","v":""},{"$f":"IF(ISBLANK('Data Input'!A94),\"\",SUM('Data Input'!H94,'Data Input'!I94,'Data Input'!N94,'Data Input'!S94))","v":""},{"$f":"IF(K89=\"\",\"\",K89/COUNTIF('Data Input'!$C$8:$AA$8,\"x\"))","v":""},{"$f":"IF(ISBLANK('Data Input'!A94),\"\",SUM('Data Input'!P94,'Data Input'!V94,'Data Input'!W94))","v":""},{"$f":"IF(M89=\"\",\"\",M89/COUNTIF('Data Input'!$C$8:$AA$8,\"÷\"))","v":""},{"$f":"IF(ISBLANK('Data Input'!A94),\"\",SUM('Data Input'!T94,'Data Input'!X94,'Data Input'!Z94,'Data Input'!AA94))","v":""},{"$f":"IF(O89=\"\",\"\",O89/COUNTIF('Data Input'!$C$8:$AA$8,\"F\"))","v":""}]
[{"$f":"IF('Data Input'!A95=0,\"\",'Data Input'!A95)","v":""},{"$f":"IF(ISBLANK('Data Input'!A95),\"\",COUNTIF('Data Input'!C95:AA95,\"\"))","v":""},{"$f":"IF(ISBLANK('Data Input'!A95),\"\",COUNTIF('Data Input'!C95:AA95,\"0\"))","v":""},{"$f":"IF(ISBLANK('Data Input'!A95),\"\",SUM(B90,C90))","v":""},{"$f":"IF(ISBLANK('Data Input'!A95),\"\",SUM('Data Input'!C95:AA95))","v":""},{"$f":"IF(E90=\"\",\"\",E90/(COUNTA('Data Input'!$C$8:$AA$8)))","v":""},{"$f":"IF(ISBLANK('Data Input'!A95),\"\",SUM('Data Input'!C95,'Data Input'!F95,'Data Input'!G95,'Data Input'!J95,'Data Input'!L95,'Data Input'!O95,'Data Input'!Q95,'Data Input'!R95,'Data Input'!U95))","v":""},{"$f":"IF(G90=\"\",\"\",G90/COUNTIF('Data Input'!$C$8:$AA$8,\"+\"))","v":""},{"$f":"IF(ISBLANK('Data Input'!A95),\"\",SUM('Data Input'!D95,'Data Input'!E95,'Data Input'!K95,'Data Input'!M95,'Data Input'!Y95))","v":""},{"$f":"IF(I90=\"\",\"\",I90/COUNTIF('Data Input'!$C$8:$AA$8,\"-\"))","v":""},{"$f":"IF(ISBLANK('Data Input'!A95),\"\",SUM('Data Input'!H95,'Data Input'!I95,'Data Input'!N95,'Data Input'!S95))","v":""},{"$f":"IF(K90=\"\",\"\",K90/COUNTIF('Data Input'!$C$8:$AA$8,\"x\"))","v":""},{"$f":"IF(ISBLANK('Data Input'!A95),\"\",SUM('Data Input'!P95,'Data Input'!V95,'Data Input'!W95))","v":""},{"$f":"IF(M90=\"\",\"\",M90/COUNTIF('Data Input'!$C$8:$AA$8,\"÷\"))","v":""},{"$f":"IF(ISBLANK('Data Input'!A95),\"\",SUM('Data Input'!T95,'Data Input'!X95,'Data Input'!Z95,'Data Input'!AA95))","v":""},{"$f":"IF(O90=\"\",\"\",O90/COUNTIF('Data Input'!$C$8:$AA$8,\"F\"))","v":""}]
[{"$f":"IF('Data Input'!A96=0,\"\",'Data Input'!A96)","v":""},{"$f":"IF(ISBLANK('Data Input'!A96),\"\",COUNTIF('Data Input'!C96:AA96,\"\"))","v":""},{"$f":"IF(ISBLANK('Data Input'!A96),\"\",COUNTIF('Data Input'!C96:AA96,\"0\"))","v":""},{"$f":"IF(ISBLANK('Data Input'!A96),\"\",SUM(B91,C91))","v":""},{"$f":"IF(ISBLANK('Data Input'!A96),\"\",SUM('Data Input'!C96:AA96))","v":""},{"$f":"IF(E91=\"\",\"\",E91/(COUNTA('Data Input'!$C$8:$AA$8)))","v":""},{"$f":"IF(ISBLANK('Data Input'!A96),\"\",SUM('Data Input'!C96,'Data Input'!F96,'Data Input'!G96,'Data Input'!J96,'Data Input'!L96,'Data Input'!O96,'Data Input'!Q96,'Data Input'!R96,'Data Input'!U96))","v":""},{"$f":"IF(G91=\"\",\"\",G91/COUNTIF('Data Input'!$C$8:$AA$8,\"+\"))","v":""},{"$f":"IF(ISBLANK('Data Input'!A96),\"\",SUM('Data Input'!D96,'Data Input'!E96,'Data Input'!K96,'Data Input'!M96,'Data Input'!Y96))","v":""},{"$f":"IF(I91=\"\",\"\",I91/COUNTIF('Data Input'!$C$8:$AA$8,\"-\"))","v":""},{"$f":"IF(ISBLANK('Data Input'!A96),\"\",SUM('Data Input'!H96,'Data Input'!I96,'Data Input'!N96,'Data Input'!S96))","v":""},{"$f":"IF(K91=\"\",\"\",K91/COUNTIF('Data Input'!$C$8:$AA$8,\"x\"))","v":""},{"$f":"IF(ISBLANK('Data Input'!A96),\"\",SUM('Data Input'!P96,'Data Input'!V96,'Data Input'!W96))","v":""},{"$f":"IF(M91=\"\",\"\",M91/COUNTIF('Data Input'!$C$8:$AA$8,\"÷\"))","v":""},{"$f":"IF(ISBLANK('Data Input'!A96),\"\",SUM('Data Input'!T96,'Data Input'!X96,'Data Input'!Z96,'Data Input'!AA96))","v":""},{"$f":"IF(O91=\"\",\"\",O91/COUNTIF('Data Input'!$C$8:$AA$8,\"F\"))","v":""}]
[{"$f":"IF('Data Input'!A97=0,\"\",'Data Input'!A97)","v":""},{"$f":"IF(ISBLANK('Data Input'!A97),\"\",COUNTIF('Data Input'!C97:AA97,\"\"))","v":""},{"$f":"IF(ISBLANK('Data Input'!A97),\"\",COUNTIF('Data Input'!C97:AA97,\"0\"))","v":""},{"$f":"IF(ISBLANK('Data Input'!A97),\"\",SUM(B92,C92))","v":""},{"$f":"IF(ISBLANK('Data Input'!A97),\"\",SUM('Data Input'!C97:AA97))","v":""},{"$f":"IF(E92=\"\",\"\",E92/(COUNTA('Data Input'!$C$8:$AA$8)))","v":""},{"$f":"IF(ISBLANK('Data Input'!A97),\"\",SUM('Data Input'!C97,'Data Input'!F97,'Data Input'!G97,'Data Input'!J97,'Data Input'!L97,'Data Input'!O97,'Data Input'!Q97,'Data Input'!R97,'Data Input'!U97))","v":""},{"$f":"IF(G92=\"\",\"\",G92/COUNTIF('Data Input'!$C$8:$AA$8,\"+\"))","v":""},{"$f":"IF(ISBLANK('Data Input'!A97),\"\",SUM('Data Input'!D97,'Data Input'!E97,'Data Input'!K97,'Data Input'!M97,'Data Input'!Y97))","v":""},{"$f":"IF(I92=\"\",\"\",I92/COUNTIF('Data Input'!$C$8:$AA$8,\"-\"))","v":""},{"$f":"IF(ISBLANK('Data Input'!A97),\"\",SUM('Data Input'!H97,'Data Input'!I97,'Data Input'!N97,'Data Input'!S97))","v":""},{"$f":"IF(K92=\"\",\"\",K92/COUNTIF('Data Input'!$C$8:$AA$8,\"x\"))","v":""},{"$f":"IF(ISBLANK('Data Input'!A97),\"\",SUM('Data Input'!P97,'Data Input'!V97,'Data Input'!W97))","v":""},{"$f":"IF(M92=\"\",\"\",M92/COUNTIF('Data Input'!$C$8:$AA$8,\"÷\"))","v":""},{"$f":"IF(ISBLANK('Data Input'!A97),\"\",SUM('Data Input'!T97,'Data Input'!X97,'Data Input'!Z97,'Data Input'!AA97))","v":""},{"$f":"IF(O92=\"\",\"\",O92/COUNTIF('Data Input'!$C$8:$AA$8,\"F\"))","v":""}]
[{"$f":"IF('Data Input'!A98=0,\"\",'Data Input'!A98)","v":""},{"$f":"IF(ISBLANK('Data Input'!A98),\"\",COUNTIF('Data Input'!C98:AA98,\"\"))","v":""},{"$f":"IF(ISBLANK('Data Input'!A98),\"\",COUNTIF('Data Input'!C98:AA98,\"0\"))","v":""},{"$f":"IF(ISBLANK('Data Input'!A98),\"\",SUM(B93,C93))","v":""},{"$f":"IF(ISBLANK('Data Input'!A98),\"\",SUM('Data Input'!C98:AA98))","v":""},{"$f":"IF(E93=\"\",\"\",E93/(COUNTA('Data Input'!$C$8:$AA$8)))","v":""},{"$f":"IF(ISBLANK('Data Input'!A98),\"\",SUM('Data Input'!C98,'Data Input'!F98,'Data Input'!G98,'Data Input'!J98,'Data Input'!L98,'Data Input'!O98,'Data Input'!Q98,'Data Input'!R98,'Data Input'!U98))","v":""},{"$f":"IF(G93=\"\",\"\",G93/COUNTIF('Data Input'!$C$8:$AA$8,\"+\"))","v":""},{"$f":"IF(ISBLANK('Data Input'!A98),\"\",SUM('Data Input'!D98,'Data Input'!E98,'Data Input'!K98,'Data Input'!M98,'Data Input'!Y98))","v":""},{"$f":"IF(I93=\"\",\"\",I93/COUNTIF('Data Input'!$C$8:$AA$8,\"-\"))","v":""},{"$f":"IF(ISBLANK('Data Input'!A98),\"\",SUM('Data Input'!H98,'Data Input'!I98,'Data Input'!N98,'Data Input'!S98))","v":""},{"$f":"IF(K93=\"\",\"\",K93/COUNTIF('Data Input'!$C$8:$AA$8,\"x\"))","v":""},{"$f":"IF(ISBLANK('Data Input'!A98),\"\",SUM('Data Input'!P98,'Data Input'!V98,'Data Input'!W98))","v":""},{"$f":"IF(M93=\"\",\"\",M93/COUNTIF('Data Input'!$C$8:$AA$8,\"÷\"))","v":""},{"$f":"IF(ISBLANK('Data Input'!A98),\"\",SUM('Data Input'!T98,'Data Input'!X98,'Data Input'!Z98,'Data Input'!AA98))","v":""},{"$f":"IF(O93=\"\",\"\",O93/COUNTIF('Data Input'!$C$8:$AA$8,\"F\"))","v":""}]
[{"$f":"IF('Data Input'!A99=0,\"\",'Data Input'!A99)","v":""},{"$f":"IF(ISBLANK('Data Input'!A99),\"\",COUNTIF('Data Input'!C99:AA99,\"\"))","v":""},{"$f":"IF(ISBLANK('Data Input'!A99),\"\",COUNTIF('Data Input'!C99:AA99,\"0\"))","v":""},{"$f":"IF(ISBLANK('Data Input'!A99),\"\",SUM(B94,C94))","v":""},{"$f":"IF(ISBLANK('Data Input'!A99),\"\",SUM('Data Input'!C99:AA99))","v":""},{"$f":"IF(E94=\"\",\"\",E94/(COUNTA('Data Input'!$C$8:$AA$8)))","v":""},{"$f":"IF(ISBLANK('Data Input'!A99),\"\",SUM('Data Input'!C99,'Data Input'!F99,'Data Input'!G99,'Data Input'!J99,'Data Input'!L99,'Data Input'!O99,'Data Input'!Q99,'Data Input'!R99,'Data Input'!U99))","v":""},{"$f":"IF(G94=\"\",\"\",G94/COUNTIF('Data Input'!$C$8:$AA$8,\"+\"))","v":""},{"$f":"IF(ISBLANK('Data Input'!A99),\"\",SUM('Data Input'!D99,'Data Input'!E99,'Data Input'!K99,'Data Input'!M99,'Data Input'!Y99))","v":""},{"$f":"IF(I94=\"\",\"\",I94/COUNTIF('Data Input'!$C$8:$AA$8,\"-\"))","v":""},{"$f":"IF(ISBLANK('Data Input'!A99),\"\",SUM('Data Input'!H99,'Data Input'!I99,'Data Input'!N99,'Data Input'!S99))","v":""},{"$f":"IF(K94=\"\",\"\",K94/COUNTIF('Data Input'!$C$8:$AA$8,\"x\"))","v":""},{"$f":"IF(ISBLANK('Data Input'!A99),\"\",SUM('Data Input'!P99,'Data Input'!V99,'Data Input'!W99))","v":""},{"$f":"IF(M94=\"\",\"\",M94/COUNTIF('Data Input'!$C$8:$AA$8,\"÷\"))","v":""},{"$f":"IF(ISBLANK('Data Input'!A99),\"\",SUM('Data Input'!T99,'Data Input'!X99,'Data Input'!Z99,'Data Input'!AA99))","v":""},{"$f":"IF(O94=\"\",\"\",O94/COUNTIF('Data Input'!$C$8:$AA$8,\"F\"))","v":""}]
[{"$f":"IF('Data Input'!A100=0,\"\",'Data Input'!A100)","v":""},{"$f":"IF(ISBLANK('Data Input'!A100),\"\",COUNTIF('Data Input'!C100:AA100,\"\"))","v":""},{"$f":"IF(ISBLANK('Data Input'!A100),\"\",COUNTIF('Data Input'!C100:AA100,\"0\"))","v":""},{"$f":"IF(ISBLANK('Data Input'!A100),\"\",SUM(B95,C95))","v":""},{"$f":"IF(ISBLANK('Data Input'!A100),\"\",SUM('Data Input'!C100:AA100))","v":""},{"$f":"IF(E95=\"\",\"\",E95/(COUNTA('Data Input'!$C$8:$AA$8)))","v":""},{"$f":"IF(ISBLANK('Data Input'!A100),\"\",SUM('Data Input'!C100,'Data Input'!F100,'Data Input'!G100,'Data Input'!J100,'Data Input'!L100,'Data Input'!O100,'Data Input'!Q100,'Data Input'!R100,'Data Input'!U100))","v":""},{"$f":"IF(G95=\"\",\"\",G95/COUNTIF('Data Input'!$C$8:$AA$8,\"+\"))","v":""},{"$f":"IF(ISBLANK('Data Input'!A100),\"\",SUM('Data Input'!D100,'Data Input'!E100,'Data Input'!K100,'Data Input'!M100,'Data Input'!Y100))","v":""},{"$f":"IF(I95=\"\",\"\",I95/COUNTIF('Data Input'!$C$8:$AA$8,\"-\"))","v":""},{"$f":"IF(ISBLANK('Data Input'!A100),\"\",SUM('Data Input'!H100,'Data Input'!I100,'Data Input'!N100,'Data Input'!S100))","v":""},{"$f":"IF(K95=\"\",\"\",K95/COUNTIF('Data Input'!$C$8:$AA$8,\"x\"))","v":""},{"$f":"IF(ISBLANK('Data Input'!A100),\"\",SUM('Data Input'!P100,'Data Input'!V100,'Data Input'!W100))","v":""},{"$f":"IF(M95=\"\",\"\",M95/COUNTIF('Data Input'!$C$8:$AA$8,\"÷\"))","v":""},{"$f":"IF(ISBLANK('Data Input'!A100),\"\",SUM('Data Input'!T100,'Data Input'!X100,'Data Input'!Z100,'Data Input'!AA100))","v":""},{"$f":"IF(O95=\"\",\"\",O95/COUNTIF('Data Input'!$C$8:$AA$8,\"F\"))","v":""}]
[{"$f":"IF('Data Input'!A101=0,\"\",'Data Input'!A101)","v":""},{"$f":"IF(ISBLANK('Data Input'!A101),\"\",COUNTIF('Data Input'!C101:AA101,\"\"))","v":""},{"$f":"IF(ISBLANK('Data Input'!A101),\"\",COUNTIF('Data Input'!C101:AA101,\"0\"))","v":""},{"$f":"IF(ISBLANK('Data Input'!A101),\"\",SUM(B96,C96))","v":""},{"$f":"IF(ISBLANK('Data Input'!A101),\"\",SUM('Data Input'!C101:AA101))","v":""},{"$f":"IF(E96=\"\",\"\",E96/(COUNTA('Data Input'!$C$8:$AA$8)))","v":""},{"$f":"IF(ISBLANK('Data Input'!A101),\"\",SUM('Data Input'!C101,'Data Input'!F101,'Data Input'!G101,'Data Input'!J101,'Data Input'!L101,'Data Input'!O101,'Data Input'!Q101,'Data Input'!R101,'Data Input'!U101))","v":""},{"$f":"IF(G96=\"\",\"\",G96/COUNTIF('Data Input'!$C$8:$AA$8,\"+\"))","v":""},{"$f":"IF(ISBLANK('Data Input'!A101),\"\",SUM('Data Input'!D101,'Data Input'!E101,'Data Input'!K101,'Data Input'!M101,'Data Input'!Y101))","v":""},{"$f":"IF(I96=\"\",\"\",I96/COUNTIF('Data Input'!$C$8:$AA$8,\"-\"))","v":""},{"$f":"IF(ISBLANK('Data Input'!A101),\"\",SUM('Data Input'!H101,'Data Input'!I101,'Data Input'!N101,'Data Input'!S101))","v":""},{"$f":"IF(K96=\"\",\"\",K96/COUNTIF('Data Input'!$C$8:$AA$8,\"x\"))","v":""},{"$f":"IF(ISBLANK('Data Input'!A101),\"\",SUM('Data Input'!P101,'Data Input'!V101,'Data Input'!W101))","v":""},{"$f":"IF(M96=\"\",\"\",M96/COUNTIF('Data Input'!$C$8:$AA$8,\"÷\"))","v":""},{"$f":"IF(ISBLANK('Data Input'!A101),\"\",SUM('Data Input'!T101,'Data Input'!X101,'Data Input'!Z101,'Data Input'!AA101))","v":""},{"$f":"IF(O96=\"\",\"\",O96/COUNTIF('Data Input'!$C$8:$AA$8,\"F\"))","v":""}]
[{"$f":"IF('Data Input'!A102=0,\"\",'Data Input'!A102)","v":""},{"$f":"IF(ISBLANK('Data Input'!A102),\"\",COUNTIF('Data Input'!C102:AA102,\"\"))","v":""},{"$f":"IF(ISBLANK('Data Input'!A102),\"\",COUNTIF('Data Input'!C102:AA102,\"0\"))","v":""},{"$f":"IF(ISBLANK('Data Input'!A102),\"\",SUM(B97,C97))","v":""},{"$f":"IF(ISBLANK('Data Input'!A102),\"\",SUM('Data Input'!C102:AA102))","v":""},{"$f":"IF(E97=\"\",\"\",E97/(COUNTA('Data Input'!$C$8:$AA$8)))","v":""},{"$f":"IF(ISBLANK('Data Input'!A102),\"\",SUM('Data Input'!C102,'Data Input'!F102,'Data Input'!G102,'Data Input'!J102,'Data Input'!L102,'Data Input'!O102,'Data Input'!Q102,'Data Input'!R102,'Data Input'!U102))","v":""},{"$f":"IF(G97=\"\",\"\",G97/COUNTIF('Data Input'!$C$8:$AA$8,\"+\"))","v":""},{"$f":"IF(ISBLANK('Data Input'!A102),\"\",SUM('Data Input'!D102,'Data Input'!E102,'Data Input'!K102,'Data Input'!M102,'Data Input'!Y102))","v":""},{"$f":"IF(I97=\"\",\"\",I97/COUNTIF('Data Input'!$C$8:$AA$8,\"-\"))","v":""},{"$f":"IF(ISBLANK('Data Input'!A102),\"\",SUM('Data Input'!H102,'Data Input'!I102,'Data Input'!N102,'Data Input'!S102))","v":""},{"$f":"IF(K97=\"\",\"\",K97/COUNTIF('Data Input'!$C$8:$AA$8,\"x\"))","v":""},{"$f":"IF(ISBLANK('Data Input'!A102),\"\",SUM('Data Input'!P102,'Data Input'!V102,'Data Input'!W102))","v":""},{"$f":"IF(M97=\"\",\"\",M97/COUNTIF('Data Input'!$C$8:$AA$8,\"÷\"))","v":""},{"$f":"IF(ISBLANK('Data Input'!A102),\"\",SUM('Data Input'!T102,'Data Input'!X102,'Data Input'!Z102,'Data Input'!AA102))","v":""},{"$f":"IF(O97=\"\",\"\",O97/COUNTIF('Data Input'!$C$8:$AA$8,\"F\"))","v":""}]
[{"$f":"IF('Data Input'!A103=0,\"\",'Data Input'!A103)","v":""},{"$f":"IF(ISBLANK('Data Input'!A103),\"\",COUNTIF('Data Input'!C103:AA103,\"\"))","v":""},{"$f":"IF(ISBLANK('Data Input'!A103),\"\",COUNTIF('Data Input'!C103:AA103,\"0\"))","v":""},{"$f":"IF(ISBLANK('Data Input'!A103),\"\",SUM(B98,C98))","v":""},{"$f":"IF(ISBLANK('Data Input'!A103),\"\",SUM('Data Input'!C103:AA103))","v":""},{"$f":"IF(E98=\"\",\"\",E98/(COUNTA('Data Input'!$C$8:$AA$8)))","v":""},{"$f":"IF(ISBLANK('Data Input'!A103),\"\",SUM('Data Input'!C103,'Data Input'!F103,'Data Input'!G103,'Data Input'!J103,'Data Input'!L103,'Data Input'!O103,'Data Input'!Q103,'Data Input'!R103,'Data Input'!U103))","v":""},{"$f":"IF(G98=\"\",\"\",G98/COUNTIF('Data Input'!$C$8:$AA$8,\"+\"))","v":""},{"$f":"IF(ISBLANK('Data Input'!A103),\"\",SUM('Data Input'!D103,'Data Input'!E103,'Data Input'!K103,'Data Input'!M103,'Data Input'!Y103))","v":""},{"$f":"IF(I98=\"\",\"\",I98/COUNTIF('Data Input'!$C$8:$AA$8,\"-\"))","v":""},{"$f":"IF(ISBLANK('Data Input'!A103),\"\",SUM('Data Input'!H103,'Data Input'!I103,'Data Input'!N103,'Data Input'!S103))","v":""},{"$f":"IF(K98=\"\",\"\",K98/COUNTIF('Data Input'!$C$8:$AA$8,\"x\"))","v":""},{"$f":"IF(ISBLANK('Data Input'!A103),\"\",SUM('Data Input'!P103,'Data Input'!V103,'Data Input'!W103))","v":""},{"$f":"IF(M98=\"\",\"\",M98/COUNTIF('Data Input'!$C$8:$AA$8,\"÷\"))","v":""},{"$f":"IF(ISBLANK('Data Input'!A103),\"\",SUM('Data Input'!T103,'Data Input'!X103,'Data Input'!Z103,'Data Input'!AA103))","v":""},{"$f":"IF(O98=\"\",\"\",O98/COUNTIF('Data Input'!$C$8:$AA$8,\"F\"))","v":""}]
[{"$f":"IF('Data Input'!A104=0,\"\",'Data Input'!A104)","v":""},{"$f":"IF(ISBLANK('Data Input'!A104),\"\",COUNTIF('Data Input'!C104:AA104,\"\"))","v":""},{"$f":"IF(ISBLANK('Data Input'!A104),\"\",COUNTIF('Data Input'!C104:AA104,\"0\"))","v":""},{"$f":"IF(ISBLANK('Data Input'!A104),\"\",SUM(B99,C99))","v":""},{"$f":"IF(ISBLANK('Data Input'!A104),\"\",SUM('Data Input'!C104:AA104))","v":""},{"$f":"IF(E99=\"\",\"\",E99/(COUNTA('Data Input'!$C$8:$AA$8)))","v":""},{"$f":"IF(ISBLANK('Data Input'!A104),\"\",SUM('Data Input'!C104,'Data Input'!F104,'Data Input'!G104,'Data Input'!J104,'Data Input'!L104,'Data Input'!O104,'Data Input'!Q104,'Data Input'!R104,'Data Input'!U104))","v":""},{"$f":"IF(G99=\"\",\"\",G99/COUNTIF('Data Input'!$C$8:$AA$8,\"+\"))","v":""},{"$f":"IF(ISBLANK('Data Input'!A104),\"\",SUM('Data Input'!D104,'Data Input'!E104,'Data Input'!K104,'Data Input'!M104,'Data Input'!Y104))","v":""},{"$f":"IF(I99=\"\",\"\",I99/COUNTIF('Data Input'!$C$8:$AA$8,\"-\"))","v":""},{"$f":"IF(ISBLANK('Data Input'!A104),\"\",SUM('Data Input'!H104,'Data Input'!I104,'Data Input'!N104,'Data Input'!S104))","v":""},{"$f":"IF(K99=\"\",\"\",K99/COUNTIF('Data Input'!$C$8:$AA$8,\"x\"))","v":""},{"$f":"IF(ISBLANK('Data Input'!A104),\"\",SUM('Data Input'!P104,'Data Input'!V104,'Data Input'!W104))","v":""},{"$f":"IF(M99=\"\",\"\",M99/COUNTIF('Data Input'!$C$8:$AA$8,\"÷\"))","v":""},{"$f":"IF(ISBLANK('Data Input'!A104),\"\",SUM('Data Input'!T104,'Data Input'!X104,'Data Input'!Z104,'Data Input'!AA104))","v":""},{"$f":"IF(O99=\"\",\"\",O99/COUNTIF('Data Input'!$C$8:$AA$8,\"F\"))","v":""}]
[{"$f":"IF('Data Input'!A105=0,\"\",'Data Input'!A105)","v":""},{"$f":"IF(ISBLANK('Data Input'!A105),\"\",COUNTIF('Data Input'!C105:AA105,\"\"))","v":""},{"$f":"IF(ISBLANK('Data Input'!A105),\"\",COUNTIF('Data Input'!C105:AA105,\"0\"))","v":""},{"$f":"IF(ISBLANK('Data Input'!A105),\"\",SUM(B100,C100))","v":""},{"$f":"IF(ISBLANK('Data Input'!A105),\"\",SUM('Data Input'!C105:AA105))","v":""},{"$f":"IF(E100=\"\",\"\",E100/(COUNTA('Data Input'!$C$8:$AA$8)))","v":""},{"$f":"IF(ISBLANK('Data Input'!A105),\"\",SUM('Data Input'!C105,'Data Input'!F105,'Data Input'!G105,'Data Input'!J105,'Data Input'!L105,'Data Input'!O105,'Data Input'!Q105,'Data Input'!R105,'Data Input'!U105))","v":""},{"$f":"IF(G100=\"\",\"\",G100/COUNTIF('Data Input'!$C$8:$AA$8,\"+\"))","v":""},{"$f":"IF(ISBLANK('Data Input'!A105),\"\",SUM('Data Input'!D105,'Data Input'!E105,'Data Input'!K105,'Data Input'!M105,'Data Input'!Y105))","v":""},{"$f":"IF(I100=\"\",\"\",I100/COUNTIF('Data Input'!$C$8:$AA$8,\"-\"))","v":""},{"$f":"IF(ISBLANK('Data Input'!A105),\"\",SUM('Data Input'!H105,'Data Input'!I105,'Data Input'!N105,'Data Input'!S105))","v":""},{"$f":"IF(K100=\"\",\"\",K100/COUNTIF('Data Input'!$C$8:$AA$8,\"x\"))","v":""},{"$f":"IF(ISBLANK('Data Input'!A105),\"\",SUM('Data Input'!P105,'Data Input'!V105,'Data Input'!W105))","v":""},{"$f":"IF(M100=\"\",\"\",M100/COUNTIF('Data Input'!$C$8:$AA$8,\"÷\"))","v":""},{"$f":"IF(ISBLANK('Data Input'!A105),\"\",SUM('Data Input'!T105,'Data Input'!X105,'Data Input'!Z105,'Data Input'!AA105))","v":""},{"$f":"IF(O100=\"\",\"\",O100/COUNTIF('Data Input'!$C$8:$AA$8,\"F\"))","v":""}]
[{"$f":"IF('Data Input'!A106=0,\"\",'Data Input'!A106)","v":""},{"$f":"IF(ISBLANK('Data Input'!A106),\"\",COUNTIF('Data Input'!C106:AA106,\"\"))","v":""},{"$f":"IF(ISBLANK('Data Input'!A106),\"\",COUNTIF('Data Input'!C106:AA106,\"0\"))","v":""},{"$f":"IF(ISBLANK('Data Input'!A106),\"\",SUM(B101,C101))","v":""},{"$f":"IF(ISBLANK('Data Input'!A106),\"\",SUM('Data Input'!C106:AA106))","v":""},{"$f":"IF(E101=\"\",\"\",E101/(COUNTA('Data Input'!$C$8:$AA$8)))","v":""},{"$f":"IF(ISBLANK('Data Input'!A106),\"\",SUM('Data Input'!C106,'Data Input'!F106,'Data Input'!G106,'Data Input'!J106,'Data Input'!L106,'Data Input'!O106,'Data Input'!Q106,'Data Input'!R106,'Data Input'!U106))","v":""},{"$f":"IF(G101=\"\",\"\",G101/COUNTIF('Data Input'!$C$8:$AA$8,\"+\"))","v":""},{"$f":"IF(ISBLANK('Data Input'!A106),\"\",SUM('Data Input'!D106,'Data Input'!E106,'Data Input'!K106,'Data Input'!M106,'Data Input'!Y106))","v":""},{"$f":"IF(I101=\"\",\"\",I101/COUNTIF('Data Input'!$C$8:$AA$8,\"-\"))","v":""},{"$f":"IF(ISBLANK('Data Input'!A106),\"\",SUM('Data Input'!H106,'Data Input'!I106,'Data Input'!N106,'Data Input'!S106))","v":""},{"$f":"IF(K101=\"\",\"\",K101/COUNTIF('Data Input'!$C$8:$AA$8,\"x\"))","v":""},{"$f":"IF(ISBLANK('Data Input'!A106),\"\",SUM('Data Input'!P106,'Data Input'!V106,'Data Input'!W106))","v":""},{"$f":"IF(M101=\"\",\"\",M101/COUNTIF('Data Input'!$C$8:$AA$8,\"÷\"))","v":""},{"$f":"IF(ISBLANK('Data Input'!A106),\"\",SUM('Data Input'!T106,'Data Input'!X106,'Data Input'!Z106,'Data Input'!AA106))","v":""},{"$f":"IF(O101=\"\",\"\",O101/COUNTIF('Data Input'!$C$8:$AA$8,\"F\"))","v":""}]
[{"$f":"IF('Data Input'!A107=0,\"\",'Data Input'!A107)","v":""},{"$f":"IF(ISBLANK('Data Input'!A107),\"\",COUNTIF('Data Input'!C107:AA107,\"\"))","v":""},{"$f":"IF(ISBLANK('Data Input'!A107),\"\",COUNTIF('Data Input'!C107:AA107,\"0\"))","v":""},{"$f":"IF(ISBLANK('Data Input'!A107),\"\",SUM(B102,C102))","v":""},{"$f":"IF(ISBLANK('Data Input'!A107),\"\",SUM('Data Input'!C107:AA107))","v":""},{"$f":"IF(E102=\"\",\"\",E102/(COUNTA('Data Input'!$C$8:$AA$8)))","v":""},{"$f":"IF(ISBLANK('Data Input'!A107),\"\",SUM('Data Input'!C107,'Data Input'!F107,'Data Input'!G107,'Data Input'!J107,'Data Input'!L107,'Data Input'!O107,'Data Input'!Q107,'Data Input'!R107,'Data Input'!U107))","v":""},{"$f":"IF(G102=\"\",\"\",G102/COUNTIF('Data Input'!$C$8:$AA$8,\"+\"))","v":""},{"$f":"IF(ISBLANK('Data Input'!A107),\"\",SUM('Data Input'!D107,'Data Input'!E107,'Data Input'!K107,'Data Input'!M107,'Data Input'!Y107))","v":""},{"$f":"IF(I102=\"\",\"\",I102/COUNTIF('Data Input'!$C$8:$AA$8,\"-\"))","v":""},{"$f":"IF(ISBLANK('Data Input'!A107),\"\",SUM('Data Input'!H107,'Data Input'!I107,'Data Input'!N107,'Data Input'!S107))","v":""},{"$f":"IF(K102=\"\",\"\",K102/COUNTIF('Data Input'!$C$8:$AA$8,\"x\"))","v":""},{"$f":"IF(ISBLANK('Data Input'!A107),\"\",SUM('Data Input'!P107,'Data Input'!V107,'Data Input'!W107))","v":""},{"$f":"IF(M102=\"\",\"\",M102/COUNTIF('Data Input'!$C$8:$AA$8,\"÷\"))","v":""},{"$f":"IF(ISBLANK('Data Input'!A107),\"\",SUM('Data Input'!T107,'Data Input'!X107,'Data Input'!Z107,'Data Input'!AA107))","v":""},{"$f":"IF(O102=\"\",\"\",O102/COUNTIF('Data Input'!$C$8:$AA$8,\"F\"))","v":""}]
[{"$f":"IF('Data Input'!A108=0,\"\",'Data Input'!A108)","v":""},{"$f":"IF(ISBLANK('Data Input'!A108),\"\",COUNTIF('Data Input'!C108:AA108,\"\"))","v":""},{"$f":"IF(ISBLANK('Data Input'!A108),\"\",COUNTIF('Data Input'!C108:AA108,\"0\"))","v":""},{"$f":"IF(ISBLANK('Data Input'!A108),\"\",SUM(B103,C103))","v":""},{"$f":"IF(ISBLANK('Data Input'!A108),\"\",SUM('Data Input'!C108:AA108))","v":""},{"$f":"IF(E103=\"\",\"\",E103/(COUNTA('Data Input'!$C$8:$AA$8)))","v":""},{"$f":"IF(ISBLANK('Data Input'!A108),\"\",SUM('Data Input'!C108,'Data Input'!F108,'Data Input'!G108,'Data Input'!J108,'Data Input'!L108,'Data Input'!O108,'Data Input'!Q108,'Data Input'!R108,'Data Input'!U108))","v":""},{"$f":"IF(G103=\"\",\"\",G103/COUNTIF('Data Input'!$C$8:$AA$8,\"+\"))","v":""},{"$f":"IF(ISBLANK('Data Input'!A108),\"\",SUM('Data Input'!D108,'Data Input'!E108,'Data Input'!K108,'Data Input'!M108,'Data Input'!Y108))","v":""},{"$f":"IF(I103=\"\",\"\",I103/COUNTIF('Data Input'!$C$8:$AA$8,\"-\"))","v":""},{"$f":"IF(ISBLANK('Data Input'!A108),\"\",SUM('Data Input'!H108,'Data Input'!I108,'Data Input'!N108,'Data Input'!S108))","v":""},{"$f":"IF(K103=\"\",\"\",K103/COUNTIF('Data Input'!$C$8:$AA$8,\"x\"))","v":""},{"$f":"IF(ISBLANK('Data Input'!A108),\"\",SUM('Data Input'!P108,'Data Input'!V108,'Data Input'!W108))","v":""},{"$f":"IF(M103=\"\",\"\",M103/COUNTIF('Data Input'!$C$8:$AA$8,\"÷\"))","v":""},{"$f":"IF(ISBLANK('Data Input'!A108),\"\",SUM('Data Input'!T108,'Data Input'!X108,'Data Input'!Z108,'Data Input'!AA108))","v":""},{"$f":"IF(O103=\"\",\"\",O103/COUNTIF('Data Input'!$C$8:$AA$8,\"F\"))","v":""}]
[{"$f":"IF('Data Input'!A109=0,\"\",'Data Input'!A109)","v":""},{"$f":"IF(ISBLANK('Data Input'!A109),\"\",COUNTIF('Data Input'!C109:AA109,\"\"))","v":""},{"$f":"IF(ISBLANK('Data Input'!A109),\"\",COUNTIF('Data Input'!C109:AA109,\"0\"))","v":""},{"$f":"IF(ISBLANK('Data Input'!A109),\"\",SUM(B104,C104))","v":""},{"$f":"IF(ISBLANK('Data Input'!A109),\"\",SUM('Data Input'!C109:AA109))","v":""},{"$f":"IF(E104=\"\",\"\",E104/(COUNTA('Data Input'!$C$8:$AA$8)))","v":""},{"$f":"IF(ISBLANK('Data Input'!A109),\"\",SUM('Data Input'!C109,'Data Input'!F109,'Data Input'!G109,'Data Input'!J109,'Data Input'!L109,'Data Input'!O109,'Data Input'!Q109,'Data Input'!R109,'Data Input'!U109))","v":""},{"$f":"IF(G104=\"\",\"\",G104/COUNTIF('Data Input'!$C$8:$AA$8,\"+\"))","v":""},{"$f":"IF(ISBLANK('Data Input'!A109),\"\",SUM('Data Input'!D109,'Data Input'!E109,'Data Input'!K109,'Data Input'!M109,'Data Input'!Y109))","v":""},{"$f":"IF(I104=\"\",\"\",I104/COUNTIF('Data Input'!$C$8:$AA$8,\"-\"))","v":""},{"$f":"IF(ISBLANK('Data Input'!A109),\"\",SUM('Data Input'!H109,'Data Input'!I109,'Data Input'!N109,'Data Input'!S109))","v":""},{"$f":"IF(K104=\"\",\"\",K104/COUNTIF('Data Input'!$C$8:$AA$8,\"x\"))","v":""},{"$f":"IF(ISBLANK('Data Input'!A109),\"\",SUM('Data Input'!P109,'Data Input'!V109,'Data Input'!W109))","v":""},{"$f":"IF(M104=\"\",\"\",M104/COUNTIF('Data Input'!$C$8:$AA$8,\"÷\"))","v":""},{"$f":"IF(ISBLANK('Data Input'!A109),\"\",SUM('Data Input'!T109,'Data Input'!X109,'Data Input'!Z109,'Data Input'!AA109))","v":""},{"$f":"IF(O104=\"\",\"\",O104/COUNTIF('Data Input'!$C$8:$AA$8,\"F\"))","v":""}]
[{"$f":"IF('Data Input'!A110=0,\"\",'Data Input'!A110)","v":""},{"$f":"IF(ISBLANK('Data Input'!A110),\"\",COUNTIF('Data Input'!C110:AA110,\"\"))","v":""},{"$f":"IF(ISBLANK('Data Input'!A110),\"\",COUNTIF('Data Input'!C110:AA110,\"0\"))","v":""},{"$f":"IF(ISBLANK('Data Input'!A110),\"\",SUM(B105,C105))","v":""},{"$f":"IF(ISBLANK('Data Input'!A110),\"\",SUM('Data Input'!C110:AA110))","v":""},{"$f":"IF(E105=\"\",\"\",E105/(COUNTA('Data Input'!$C$8:$AA$8)))","v":""},{"$f":"IF(ISBLANK('Data Input'!A110),\"\",SUM('Data Input'!C110,'Data Input'!F110,'Data Input'!G110,'Data Input'!J110,'Data Input'!L110,'Data Input'!O110,'Data Input'!Q110,'Data Input'!R110,'Data Input'!U110))","v":""},{"$f":"IF(G105=\"\",\"\",G105/COUNTIF('Data Input'!$C$8:$AA$8,\"+\"))","v":""},{"$f":"IF(ISBLANK('Data Input'!A110),\"\",SUM('Data Input'!D110,'Data Input'!E110,'Data Input'!K110,'Data Input'!M110,'Data Input'!Y110))","v":""},{"$f":"IF(I105=\"\",\"\",I105/COUNTIF('Data Input'!$C$8:$AA$8,\"-\"))","v":""},{"$f":"IF(ISBLANK('Data Input'!A110),\"\",SUM('Data Input'!H110,'Data Input'!I110,'Data Input'!N110,'Data Input'!S110))","v":""},{"$f":"IF(K105=\"\",\"\",K105/COUNTIF('Data Input'!$C$8:$AA$8,\"x\"))","v":""},{"$f":"IF(ISBLANK('Data Input'!A110),\"\",SUM('Data Input'!P110,'Data Input'!V110,'Data Input'!W110))","v":""},{"$f":"IF(M105=\"\",\"\",M105/COUNTIF('Data Input'!$C$8:$AA$8,\"÷\"))","v":""},{"$f":"IF(ISBLANK('Data Input'!A110),\"\",SUM('Data Input'!T110,'Data Input'!X110,'Data Input'!Z110,'Data Input'!AA110))","v":""},{"$f":"IF(O105=\"\",\"\",O105/COUNTIF('Data Input'!$C$8:$AA$8,\"F\"))","v":""}]
[{"$f":"IF('Data Input'!A111=0,\"\",'Data Input'!A111)","v":""},{"$f":"IF(ISBLANK('Data Input'!A111),\"\",COUNTIF('Data Input'!C111:AA111,\"\"))","v":""},{"$f":"IF(ISBLANK('Data Input'!A111),\"\",COUNTIF('Data Input'!C111:AA111,\"0\"))","v":""},{"$f":"IF(ISBLANK('Data Input'!A111),\"\",SUM(B106,C106))","v":""},{"$f":"IF(ISBLANK('Data Input'!A111),\"\",SUM('Data Input'!C111:AA111))","v":""},{"$f":"IF(E106=\"\",\"\",E106/(COUNTA('Data Input'!$C$8:$AA$8)))","v":""},{"$f":"IF(ISBLANK('Data Input'!A111),\"\",SUM('Data Input'!C111,'Data Input'!F111,'Data Input'!G111,'Data Input'!J111,'Data Input'!L111,'Data Input'!O111,'Data Input'!Q111,'Data Input'!R111,'Data Input'!U111))","v":""},{"$f":"IF(G106=\"\",\"\",G106/COUNTIF('Data Input'!$C$8:$AA$8,\"+\"))","v":""},{"$f":"IF(ISBLANK('Data Input'!A111),\"\",SUM('Data Input'!D111,'Data Input'!E111,'Data Input'!K111,'Data Input'!M111,'Data Input'!Y111))","v":""},{"$f":"IF(I106=\"\",\"\",I106/COUNTIF('Data Input'!$C$8:$AA$8,\"-\"))","v":""},{"$f":"IF(ISBLANK('Data Input'!A111),\"\",SUM('Data Input'!H111,'Data Input'!I111,'Data Input'!N111,'Data Input'!S111))","v":""},{"$f":"IF(K106=\"\",\"\",K106/COUNTIF('Data Input'!$C$8:$AA$8,\"x\"))","v":""},{"$f":"IF(ISBLANK('Data Input'!A111),\"\",SUM('Data Input'!P111,'Data Input'!V111,'Data Input'!W111))","v":""},{"$f":"IF(M106=\"\",\"\",M106/COUNTIF('Data Input'!$C$8:$AA$8,\"÷\"))","v":""},{"$f":"IF(ISBLANK('Data Input'!A111),\"\",SUM('Data Input'!T111,'Data Input'!X111,'Data Input'!Z111,'Data Input'!AA111))","v":""},{"$f":"IF(O106=\"\",\"\",O106/COUNTIF('Data Input'!$C$8:$AA$8,\"F\"))","v":""}]
[{"$f":"IF('Data Input'!A112=0,\"\",'Data Input'!A112)","v":""},{"$f":"IF(ISBLANK('Data Input'!A112),\"\",COUNTIF('Data Input'!C112:AA112,\"\"))","v":""},{"$f":"IF(ISBLANK('Data Input'!A112),\"\",COUNTIF('Data Input'!C112:AA112,\"0\"))","v":""},{"$f":"IF(ISBLANK('Data Input'!A112),\"\",SUM(B107,C107))","v":""},{"$f":"IF(ISBLANK('Data Input'!A112),\"\",SUM('Data Input'!C112:AA112))","v":""},{"$f":"IF(E107=\"\",\"\",E107/(COUNTA('Data Input'!$C$8:$AA$8)))","v":""},{"$f":"IF(ISBLANK('Data Input'!A112),\"\",SUM('Data Input'!C112,'Data Input'!F112,'Data Input'!G112,'Data Input'!J112,'Data Input'!L112,'Data Input'!O112,'Data Input'!Q112,'Data Input'!R112,'Data Input'!U112))","v":""},{"$f":"IF(G107=\"\",\"\",G107/COUNTIF('Data Input'!$C$8:$AA$8,\"+\"))","v":""},{"$f":"IF(ISBLANK('Data Input'!A112),\"\",SUM('Data Input'!D112,'Data Input'!E112,'Data Input'!K112,'Data Input'!M112,'Data Input'!Y112))","v":""},{"$f":"IF(I107=\"\",\"\",I107/COUNTIF('Data Input'!$C$8:$AA$8,\"-\"))","v":""},{"$f":"IF(ISBLANK('Data Input'!A112),\"\",SUM('Data Input'!H112,'Data Input'!I112,'Data Input'!N112,'Data Input'!S112))","v":""},{"$f":"IF(K107=\"\",\"\",K107/COUNTIF('Data Input'!$C$8:$AA$8,\"x\"))","v":""},{"$f":"IF(ISBLANK('Data Input'!A112),\"\",SUM('Data Input'!P112,'Data Input'!V112,'Data Input'!W112))","v":""},{"$f":"IF(M107=\"\",\"\",M107/COUNTIF('Data Input'!$C$8:$AA$8,\"÷\"))","v":""},{"$f":"IF(ISBLANK('Data Input'!A112),\"\",SUM('Data Input'!T112,'Data Input'!X112,'Data Input'!Z112,'Data Input'!AA112))","v":""},{"$f":"IF(O107=\"\",\"\",O107/COUNTIF('Data Input'!$C$8:$AA$8,\"F\"))","v":""}]
[{"$f":"IF('Data Input'!A113=0,\"\",'Data Input'!A113)","v":""},{"$f":"IF(ISBLANK('Data Input'!A113),\"\",COUNTIF('Data Input'!C113:AA113,\"\"))","v":""},{"$f":"IF(ISBLANK('Data Input'!A113),\"\",COUNTIF('Data Input'!C113:AA113,\"0\"))","v":""},{"$f":"IF(ISBLANK('Data Input'!A113),\"\",SUM(B108,C108))","v":""},{"$f":"IF(ISBLANK('Data Input'!A113),\"\",SUM('Data Input'!C113:AA113))","v":""},{"$f":"IF(E108=\"\",\"\",E108/(COUNTA('Data Input'!$C$8:$AA$8)))","v":""},{"$f":"IF(ISBLANK('Data Input'!A113),\"\",SUM('Data Input'!C113,'Data Input'!F113,'Data Input'!G113,'Data Input'!J113,'Data Input'!L113,'Data Input'!O113,'Data Input'!Q113,'Data Input'!R113,'Data Input'!U113))","v":""},{"$f":"IF(G108=\"\",\"\",G108/COUNTIF('Data Input'!$C$8:$AA$8,\"+\"))","v":""},{"$f":"IF(ISBLANK('Data Input'!A113),\"\",SUM('Data Input'!D113,'Data Input'!E113,'Data Input'!K113,'Data Input'!M113,'Data Input'!Y113))","v":""},{"$f":"IF(I108=\"\",\"\",I108/COUNTIF('Data Input'!$C$8:$AA$8,\"-\"))","v":""},{"$f":"IF(ISBLANK('Data Input'!A113),\"\",SUM('Data Input'!H113,'Data Input'!I113,'Data Input'!N113,'Data Input'!S113))","v":""},{"$f":"IF(K108=\"\",\"\",K108/COUNTIF('Data Input'!$C$8:$AA$8,\"x\"))","v":""},{"$f":"IF(ISBLANK('Data Input'!A113),\"\",SUM('Data Input'!P113,'Data Input'!V113,'Data Input'!W113))","v":""},{"$f":"IF(M108=\"\",\"\",M108/COUNTIF('Data Input'!$C$8:$AA$8,\"÷\"))","v":""},{"$f":"IF(ISBLANK('Data Input'!A113),\"\",SUM('Data Input'!T113,'Data Input'!X113,'Data Input'!Z113,'Data Input'!AA113))","v":""},{"$f":"IF(O108=\"\",\"\",O108/COUNTIF('Data Input'!$C$8:$AA$8,\"F\"))","v":""}]
[{"$f":"IF('Data Input'!A114=0,\"\",'Data Input'!A114)","v":""},{"$f":"IF(ISBLANK('Data Input'!A114),\"\",COUNTIF('Data Input'!C114:AA114,\"\"))","v":""},{"$f":"IF(ISBLANK('Data Input'!A114),\"\",COUNTIF('Data Input'!C114:AA114,\"0\"))","v":""},{"$f":"IF(ISBLANK('Data Input'!A114),\"\",SUM(B109,C109))","v":""},{"$f":"IF(ISBLANK('Data Input'!A114),\"\",SUM('Data Input'!C114:AA114))","v":""},{"$f":"IF(E109=\"\",\"\",E109/(COUNTA('Data Input'!$C$8:$AA$8)))","v":""},{"$f":"IF(ISBLANK('Data Input'!A114),\"\",SUM('Data Input'!C114,'Data Input'!F114,'Data Input'!G114,'Data Input'!J114,'Data Input'!L114,'Data Input'!O114,'Data Input'!Q114,'Data Input'!R114,'Data Input'!U114))","v":""},{"$f":"IF(G109=\"\",\"\",G109/COUNTIF('Data Input'!$C$8:$AA$8,\"+\"))","v":""},{"$f":"IF(ISBLANK('Data Input'!A114),\"\",SUM('Data Input'!D114,'Data Input'!E114,'Data Input'!K114,'Data Input'!M114,'Data Input'!Y114))","v":""},{"$f":"IF(I109=\"\",\"\",I109/COUNTIF('Data Input'!$C$8:$AA$8,\"-\"))","v":""},{"$f":"IF(ISBLANK('Data Input'!A114),\"\",SUM('Data Input'!H114,'Data Input'!I114,'Data Input'!N114,'Data Input'!S114))","v":""},{"$f":"IF(K109=\"\",\"\",K109/COUNTIF('Data Input'!$C$8:$AA$8,\"x\"))","v":""},{"$f":"IF(ISBLANK('Data Input'!A114),\"\",SUM('Data Input'!P114,'Data Input'!V114,'Data Input'!W114))","v":""},{"$f":"IF(M109=\"\",\"\",M109/COUNTIF('Data Input'!$C$8:$AA$8,\"÷\"))","v":""},{"$f":"IF(ISBLANK('Data Input'!A114),\"\",SUM('Data Input'!T114,'Data Input'!X114,'Data Input'!Z114,'Data Input'!AA114))","v":""},{"$f":"IF(O109=\"\",\"\",O109/COUNTIF('Data Input'!$C$8:$AA$8,\"F\"))","v":""}]
[{"$f":"IF('Data Input'!A115=0,\"\",'Data Input'!A115)","v":""},{"$f":"IF(ISBLANK('Data Input'!A115),\"\",COUNTIF('Data Input'!C115:AA115,\"\"))","v":""},{"$f":"IF(ISBLANK('Data Input'!A115),\"\",COUNTIF('Data Input'!C115:AA115,\"0\"))","v":""},{"$f":"IF(ISBLANK('Data Input'!A115),\"\",SUM(B110,C110))","v":""},{"$f":"IF(ISBLANK('Data Input'!A115),\"\",SUM('Data Input'!C115:AA115))","v":""},{"$f":"IF(E110=\"\",\"\",E110/(COUNTA('Data Input'!$C$8:$AA$8)))","v":""},{"$f":"IF(ISBLANK('Data Input'!A115),\"\",SUM('Data Input'!C115,'Data Input'!F115,'Data Input'!G115,'Data Input'!J115,'Data Input'!L115,'Data Input'!O115,'Data Input'!Q115,'Data Input'!R115,'Data Input'!U115))","v":""},{"$f":"IF(G110=\"\",\"\",G110/COUNTIF('Data Input'!$C$8:$AA$8,\"+\"))","v":""},{"$f":"IF(ISBLANK('Data Input'!A115),\"\",SUM('Data Input'!D115,'Data Input'!E115,'Data Input'!K115,'Data Input'!M115,'Data Input'!Y115))","v":""},{"$f":"IF(I110=\"\",\"\",I110/COUNTIF('Data Input'!$C$8:$AA$8,\"-\"))","v":""},{"$f":"IF(ISBLANK('Data Input'!A115),\"\",SUM('Data Input'!H115,'Data Input'!I115,'Data Input'!N115,'Data Input'!S115))","v":""},{"$f":"IF(K110=\"\",\"\",K110/COUNTIF('Data Input'!$C$8:$AA$8,\"x\"))","v":""},{"$f":"IF(ISBLANK('Data Input'!A115),\"\",SUM('Data Input'!P115,'Data Input'!V115,'Data Input'!W115))","v":""},{"$f":"IF(M110=\"\",\"\",M110/COUNTIF('Data Input'!$C$8:$AA$8,\"÷\"))","v":""},{"$f":"IF(ISBLANK('Data Input'!A115),\"\",SUM('Data Input'!T115,'Data Input'!X115,'Data Input'!Z115,'Data Input'!AA115))","v":""},{"$f":"IF(O110=\"\",\"\",O110/COUNTIF('Data Input'!$C$8:$AA$8,\"F\"))","v":""}]
[{"$f":"IF('Data Input'!A116=0,\"\",'Data Input'!A116)","v":""},{"$f":"IF(ISBLANK('Data Input'!A116),\"\",COUNTIF('Data Input'!C116:AA116,\"\"))","v":""},{"$f":"IF(ISBLANK('Data Input'!A116),\"\",COUNTIF('Data Input'!C116:AA116,\"0\"))","v":""},{"$f":"IF(ISBLANK('Data Input'!A116),\"\",SUM(B111,C111))","v":""},{"$f":"IF(ISBLANK('Data Input'!A116),\"\",SUM('Data Input'!C116:AA116))","v":""},{"$f":"IF(E111=\"\",\"\",E111/(COUNTA('Data Input'!$C$8:$AA$8)))","v":""},{"$f":"IF(ISBLANK('Data Input'!A116),\"\",SUM('Data Input'!C116,'Data Input'!F116,'Data Input'!G116,'Data Input'!J116,'Data Input'!L116,'Data Input'!O116,'Data Input'!Q116,'Data Input'!R116,'Data Input'!U116))","v":""},{"$f":"IF(G111=\"\",\"\",G111/COUNTIF('Data Input'!$C$8:$AA$8,\"+\"))","v":""},{"$f":"IF(ISBLANK('Data Input'!A116),\"\",SUM('Data Input'!D116,'Data Input'!E116,'Data Input'!K116,'Data Input'!M116,'Data Input'!Y116))","v":""},{"$f":"IF(I111=\"\",\"\",I111/COUNTIF('Data Input'!$C$8:$AA$8,\"-\"))","v":""},{"$f":"IF(ISBLANK('Data Input'!A116),\"\",SUM('Data Input'!H116,'Data Input'!I116,'Data Input'!N116,'Data Input'!S116))","v":""},{"$f":"IF(K111=\"\",\"\",K111/COUNTIF('Data Input'!$C$8:$AA$8,\"x\"))","v":""},{"$f":"IF(ISBLANK('Data Input'!A116),\"\",SUM('Data Input'!P116,'Data Input'!V116,'Data Input'!W116))","v":""},{"$f":"IF(M111=\"\",\"\",M111/COUNTIF('Data Input'!$C$8:$AA$8,\"÷\"))","v":""},{"$f":"IF(ISBLANK('Data Input'!A116),\"\",SUM('Data Input'!T116,'Data Input'!X116,'Data Input'!Z116,'Data Input'!AA116))","v":""},{"$f":"IF(O111=\"\",\"\",O111/COUNTIF('Data Input'!$C$8:$AA$8,\"F\"))","v":""}]
[{"$f":"IF('Data Input'!A117=0,\"\",'Data Input'!A117)","v":""},{"$f":"IF(ISBLANK('Data Input'!A117),\"\",COUNTIF('Data Input'!C117:AA117,\"\"))","v":""},{"$f":"IF(ISBLANK('Data Input'!A117),\"\",COUNTIF('Data Input'!C117:AA117,\"0\"))","v":""},{"$f":"IF(ISBLANK('Data Input'!A117),\"\",SUM(B112,C112))","v":""},{"$f":"IF(ISBLANK('Data Input'!A117),\"\",SUM('Data Input'!C117:AA117))","v":""},{"$f":"IF(E112=\"\",\"\",E112/(COUNTA('Data Input'!$C$8:$AA$8)))","v":""},{"$f":"IF(ISBLANK('Data Input'!A117),\"\",SUM('Data Input'!C117,'Data Input'!F117,'Data Input'!G117,'Data Input'!J117,'Data Input'!L117,'Data Input'!O117,'Data Input'!Q117,'Data Input'!R117,'Data Input'!U117))","v":""},{"$f":"IF(G112=\"\",\"\",G112/COUNTIF('Data Input'!$C$8:$AA$8,\"+\"))","v":""},{"$f":"IF(ISBLANK('Data Input'!A117),\"\",SUM('Data Input'!D117,'Data Input'!E117,'Data Input'!K117,'Data Input'!M117,'Data Input'!Y117))","v":""},{"$f":"IF(I112=\"\",\"\",I112/COUNTIF('Data Input'!$C$8:$AA$8,\"-\"))","v":""},{"$f":"IF(ISBLANK('Data Input'!A117),\"\",SUM('Data Input'!H117,'Data Input'!I117,'Data Input'!N117,'Data Input'!S117))","v":""},{"$f":"IF(K112=\"\",\"\",K112/COUNTIF('Data Input'!$C$8:$AA$8,\"x\"))","v":""},{"$f":"IF(ISBLANK('Data Input'!A117),\"\",SUM('Data Input'!P117,'Data Input'!V117,'Data Input'!W117))","v":""},{"$f":"IF(M112=\"\",\"\",M112/COUNTIF('Data Input'!$C$8:$AA$8,\"÷\"))","v":""},{"$f":"IF(ISBLANK('Data Input'!A117),\"\",SUM('Data Input'!T117,'Data Input'!X117,'Data Input'!Z117,'Data Input'!AA117))","v":""},{"$f":"IF(O112=\"\",\"\",O112/COUNTIF('Data Input'!$C$8:$AA$8,\"F\"))","v":""}]
[{"$f":"IF('Data Input'!A118=0,\"\",'Data Input'!A118)","v":""},{"$f":"IF(ISBLANK('Data Input'!A118),\"\",COUNTIF('Data Input'!C118:AA118,\"\"))","v":""},{"$f":"IF(ISBLANK('Data Input'!A118),\"\",COUNTIF('Data Input'!C118:AA118,\"0\"))","v":""},{"$f":"IF(ISBLANK('Data Input'!A118),\"\",SUM(B113,C113))","v":""},{"$f":"IF(ISBLANK('Data Input'!A118),\"\",SUM('Data Input'!C118:AA118))","v":""},{"$f":"IF(E113=\"\",\"\",E113/(COUNTA('Data Input'!$C$8:$AA$8)))","v":""},{"$f":"IF(ISBLANK('Data Input'!A118),\"\",SUM('Data Input'!C118,'Data Input'!F118,'Data Input'!G118,'Data Input'!J118,'Data Input'!L118,'Data Input'!O118,'Data Input'!Q118,'Data Input'!R118,'Data Input'!U118))","v":""},{"$f":"IF(G113=\"\",\"\",G113/COUNTIF('Data Input'!$C$8:$AA$8,\"+\"))","v":""},{"$f":"IF(ISBLANK('Data Input'!A118),\"\",SUM('Data Input'!D118,'Data Input'!E118,'Data Input'!K118,'Data Input'!M118,'Data Input'!Y118))","v":""},{"$f":"IF(I113=\"\",\"\",I113/COUNTIF('Data Input'!$C$8:$AA$8,\"-\"))","v":""},{"$f":"IF(ISBLANK('Data Input'!A118),\"\",SUM('Data Input'!H118,'Data Input'!I118,'Data Input'!N118,'Data Input'!S118))","v":""},{"$f":"IF(K113=\"\",\"\",K113/COUNTIF('Data Input'!$C$8:$AA$8,\"x\"))","v":""},{"$f":"IF(ISBLANK('Data Input'!A118),\"\",SUM('Data Input'!P118,'Data Input'!V118,'Data Input'!W118))","v":""},{"$f":"IF(M113=\"\",\"\",M113/COUNTIF('Data Input'!$C$8:$AA$8,\"÷\"))","v":""},{"$f":"IF(ISBLANK('Data Input'!A118),\"\",SUM('Data Input'!T118,'Data Input'!X118,'Data Input'!Z118,'Data Input'!AA118))","v":""},{"$f":"IF(O113=\"\",\"\",O113/COUNTIF('Data Input'!$C$8:$AA$8,\"F\"))","v":""}]
[{"$f":"IF('Data Input'!A119=0,\"\",'Data Input'!A119)","v":""},{"$f":"IF(ISBLANK('Data Input'!A119),\"\",COUNTIF('Data Input'!C119:AA119,\"\"))","v":""},{"$f":"IF(ISBLANK('Data Input'!A119),\"\",COUNTIF('Data Input'!C119:AA119,\"0\"))","v":""},{"$f":"IF(ISBLANK('Data Input'!A119),\"\",SUM(B114,C114))","v":""},{"$f":"IF(ISBLANK('Data Input'!A119),\"\",SUM('Data Input'!C119:AA119))","v":""},{"$f":"IF(E114=\"\",\"\",E114/(COUNTA('Data Input'!$C$8:$AA$8)))","v":""},{"$f":"IF(ISBLANK('Data Input'!A119),\"\",SUM('Data Input'!C119,'Data Input'!F119,'Data Input'!G119,'Data Input'!J119,'Data Input'!L119,'Data Input'!O119,'Data Input'!Q119,'Data Input'!R119,'Data Input'!U119))","v":""},{"$f":"IF(G114=\"\",\"\",G114/COUNTIF('Data Input'!$C$8:$AA$8,\"+\"))","v":""},{"$f":"IF(ISBLANK('Data Input'!A119),\"\",SUM('Data Input'!D119,'Data Input'!E119,'Data Input'!K119,'Data Input'!M119,'Data Input'!Y119))","v":""},{"$f":"IF(I114=\"\",\"\",I114/COUNTIF('Data Input'!$C$8:$AA$8,\"-\"))","v":""},{"$f":"IF(ISBLANK('Data Input'!A119),\"\",SUM('Data Input'!H119,'Data Input'!I119,'Data Input'!N119,'Data Input'!S119))","v":""},{"$f":"IF(K114=\"\",\"\",K114/COUNTIF('Data Input'!$C$8:$AA$8,\"x\"))","v":""},{"$f":"IF(ISBLANK('Data Input'!A119),\"\",SUM('Data Input'!P119,'Data Input'!V119,'Data Input'!W119))","v":""},{"$f":"IF(M114=\"\",\"\",M114/COUNTIF('Data Input'!$C$8:$AA$8,\"÷\"))","v":""},{"$f":"IF(ISBLANK('Data Input'!A119),\"\",SUM('Data Input'!T119,'Data Input'!X119,'Data Input'!Z119,'Data Input'!AA119))","v":""},{"$f":"IF(O114=\"\",\"\",O114/COUNTIF('Data Input'!$C$8:$AA$8,\"F\"))","v":""}]
[{"$f":"IF('Data Input'!A120=0,\"\",'Data Input'!A120)","v":""},{"$f":"IF(ISBLANK('Data Input'!A120),\"\",COUNTIF('Data Input'!C120:AA120,\"\"))","v":""},{"$f":"IF(ISBLANK('Data Input'!A120),\"\",COUNTIF('Data Input'!C120:AA120,\"0\"))","v":""},{"$f":"IF(ISBLANK('Data Input'!A120),\"\",SUM(B115,C115))","v":""},{"$f":"IF(ISBLANK('Data Input'!A120),\"\",SUM('Data Input'!C120:AA120))","v":""},{"$f":"IF(E115=\"\",\"\",E115/(COUNTA('Data Input'!$C$8:$AA$8)))","v":""},{"$f":"IF(ISBLANK('Data Input'!A120),\"\",SUM('Data Input'!C120,'Data Input'!F120,'Data Input'!G120,'Data Input'!J120,'Data Input'!L120,'Data Input'!O120,'Data Input'!Q120,'Data Input'!R120,'Data Input'!U120))","v":""},{"$f":"IF(G115=\"\",\"\",G115/COUNTIF('Data Input'!$C$8:$AA$8,\"+\"))","v":""},{"$f":"IF(ISBLANK('Data Input'!A120),\"\",SUM('Data Input'!D120,'Data Input'!E120,'Data Input'!K120,'Data Input'!M120,'Data Input'!Y120))","v":""},{"$f":"IF(I115=\"\",\"\",I115/COUNTIF('Data Input'!$C$8:$AA$8,\"-\"))","v":""},{"$f":"IF(ISBLANK('Data Input'!A120),\"\",SUM('Data Input'!H120,'Data Input'!I120,'Data Input'!N120,'Data Input'!S120))","v":""},{"$f":"IF(K115=\"\",\"\",K115/COUNTIF('Data Input'!$C$8:$AA$8,\"x\"))","v":""},{"$f":"IF(ISBLANK('Data Input'!A120),\"\",SUM('Data Input'!P120,'Data Input'!V120,'Data Input'!W120))","v":""},{"$f":"IF(M115=\"\",\"\",M115/COUNTIF('Data Input'!$C$8:$AA$8,\"÷\"))","v":""},{"$f":"IF(ISBLANK('Data Input'!A120),\"\",SUM('Data Input'!T120,'Data Input'!X120,'Data Input'!Z120,'Data Input'!AA120))","v":""},{"$f":"IF(O115=\"\",\"\",O115/COUNTIF('Data Input'!$C$8:$AA$8,\"F\"))","v":""}]
[{"$f":"IF('Data Input'!A121=0,\"\",'Data Input'!A121)","v":""},{"$f":"IF(ISBLANK('Data Input'!A121),\"\",COUNTIF('Data Input'!C121:AA121,\"\"))","v":""},{"$f":"IF(ISBLANK('Data Input'!A121),\"\",COUNTIF('Data Input'!C121:AA121,\"0\"))","v":""},{"$f":"IF(ISBLANK('Data Input'!A121),\"\",SUM(B116,C116))","v":""},{"$f":"IF(ISBLANK('Data Input'!A121),\"\",SUM('Data Input'!C121:AA121))","v":""},{"$f":"IF(E116=\"\",\"\",E116/(COUNTA('Data Input'!$C$8:$AA$8)))","v":""},{"$f":"IF(ISBLANK('Data Input'!A121),\"\",SUM('Data Input'!C121,'Data Input'!F121,'Data Input'!G121,'Data Input'!J121,'Data Input'!L121,'Data Input'!O121,'Data Input'!Q121,'Data Input'!R121,'Data Input'!U121))","v":""},{"$f":"IF(G116=\"\",\"\",G116/COUNTIF('Data Input'!$C$8:$AA$8,\"+\"))","v":""},{"$f":"IF(ISBLANK('Data Input'!A121),\"\",SUM('Data Input'!D121,'Data Input'!E121,'Data Input'!K121,'Data Input'!M121,'Data Input'!Y121))","v":""},{"$f":"IF(I116=\"\",\"\",I116/COUNTIF('Data Input'!$C$8:$AA$8,\"-\"))","v":""},{"$f":"IF(ISBLANK('Data Input'!A121),\"\",SUM('Data Input'!H121,'Data Input'!I121,'Data Input'!N121,'Data Input'!S121))","v":""},{"$f":"IF(K116=\"\",\"\",K116/COUNTIF('Data Input'!$C$8:$AA$8,\"x\"))","v":""},{"$f":"IF(ISBLANK('Data Input'!A121),\"\",SUM('Data Input'!P121,'Data Input'!V121,'Data Input'!W121))","v":""},{"$f":"IF(M116=\"\",\"\",M116/COUNTIF('Data Input'!$C$8:$AA$8,\"÷\"))","v":""},{"$f":"IF(ISBLANK('Data Input'!A121),\"\",SUM('Data Input'!T121,'Data Input'!X121,'Data Input'!Z121,'Data Input'!AA121))","v":""},{"$f":"IF(O116=\"\",\"\",O116/COUNTIF('Data Input'!$C$8:$AA$8,\"F\"))","v":""}]
[{"$f":"IF('Data Input'!A122=0,\"\",'Data Input'!A122)","v":""},{"$f":"IF(ISBLANK('Data Input'!A122),\"\",COUNTIF('Data Input'!C122:AA122,\"\"))","v":""},{"$f":"IF(ISBLANK('Data Input'!A122),\"\",COUNTIF('Data Input'!C122:AA122,\"0\"))","v":""},{"$f":"IF(ISBLANK('Data Input'!A122),\"\",SUM(B117,C117))","v":""},{"$f":"IF(ISBLANK('Data Input'!A122),\"\",SUM('Data Input'!C122:AA122))","v":""},{"$f":"IF(E117=\"\",\"\",E117/(COUNTA('Data Input'!$C$8:$AA$8)))","v":""},{"$f":"IF(ISBLANK('Data Input'!A122),\"\",SUM('Data Input'!C122,'Data Input'!F122,'Data Input'!G122,'Data Input'!J122,'Data Input'!L122,'Data Input'!O122,'Data Input'!Q122,'Data Input'!R122,'Data Input'!U122))","v":""},{"$f":"IF(G117=\"\",\"\",G117/COUNTIF('Data Input'!$C$8:$AA$8,\"+\"))","v":""},{"$f":"IF(ISBLANK('Data Input'!A122),\"\",SUM('Data Input'!D122,'Data Input'!E122,'Data Input'!K122,'Data Input'!M122,'Data Input'!Y122))","v":""},{"$f":"IF(I117=\"\",\"\",I117/COUNTIF('Data Input'!$C$8:$AA$8,\"-\"))","v":""},{"$f":"IF(ISBLANK('Data Input'!A122),\"\",SUM('Data Input'!H122,'Data Input'!I122,'Data Input'!N122,'Data Input'!S122))","v":""},{"$f":"IF(K117=\"\",\"\",K117/COUNTIF('Data Input'!$C$8:$AA$8,\"x\"))","v":""},{"$f":"IF(ISBLANK('Data Input'!A122),\"\",SUM('Data Input'!P122,'Data Input'!V122,'Data Input'!W122))","v":""},{"$f":"IF(M117=\"\",\"\",M117/COUNTIF('Data Input'!$C$8:$AA$8,\"÷\"))","v":""},{"$f":"IF(ISBLANK('Data Input'!A122),\"\",SUM('Data Input'!T122,'Data Input'!X122,'Data Input'!Z122,'Data Input'!AA122))","v":""},{"$f":"IF(O117=\"\",\"\",O117/COUNTIF('Data Input'!$C$8:$AA$8,\"F\"))","v":""}]
[{"$f":"IF('Data Input'!A123=0,\"\",'Data Input'!A123)","v":""},{"$f":"IF(ISBLANK('Data Input'!A123),\"\",COUNTIF('Data Input'!C123:AA123,\"\"))","v":""},{"$f":"IF(ISBLANK('Data Input'!A123),\"\",COUNTIF('Data Input'!C123:AA123,\"0\"))","v":""},{"$f":"IF(ISBLANK('Data Input'!A123),\"\",SUM(B118,C118))","v":""},{"$f":"IF(ISBLANK('Data Input'!A123),\"\",SUM('Data Input'!C123:AA123))","v":""},{"$f":"IF(E118=\"\",\"\",E118/(COUNTA('Data Input'!$C$8:$AA$8)))","v":""},{"$f":"IF(ISBLANK('Data Input'!A123),\"\",SUM('Data Input'!C123,'Data Input'!F123,'Data Input'!G123,'Data Input'!J123,'Data Input'!L123,'Data Input'!O123,'Data Input'!Q123,'Data Input'!R123,'Data Input'!U123))","v":""},{"$f":"IF(G118=\"\",\"\",G118/COUNTIF('Data Input'!$C$8:$AA$8,\"+\"))","v":""},{"$f":"IF(ISBLANK('Data Input'!A123),\"\",SUM('Data Input'!D123,'Data Input'!E123,'Data Input'!K123,'Data Input'!M123,'Data Input'!Y123))","v":""},{"$f":"IF(I118=\"\",\"\",I118/COUNTIF('Data Input'!$C$8:$AA$8,\"-\"))","v":""},{"$f":"IF(ISBLANK('Data Input'!A123),\"\",SUM('Data Input'!H123,'Data Input'!I123,'Data Input'!N123,'Data Input'!S123))","v":""},{"$f":"IF(K118=\"\",\"\",K118/COUNTIF('Data Input'!$C$8:$AA$8,\"x\"))","v":""},{"$f":"IF(ISBLANK('Data Input'!A123),\"\",SUM('Data Input'!P123,'Data Input'!V123,'Data Input'!W123))","v":""},{"$f":"IF(M118=\"\",\"\",M118/COUNTIF('Data Input'!$C$8:$AA$8,\"÷\"))","v":""},{"$f":"IF(ISBLANK('Data Input'!A123),\"\",SUM('Data Input'!T123,'Data Input'!X123,'Data Input'!Z123,'Data Input'!AA123))","v":""},{"$f":"IF(O118=\"\",\"\",O118/COUNTIF('Data Input'!$C$8:$AA$8,\"F\"))","v":""}]
[{"$f":"IF('Data Input'!A124=0,\"\",'Data Input'!A124)","v":""},{"$f":"IF(ISBLANK('Data Input'!A124),\"\",COUNTIF('Data Input'!C124:AA124,\"\"))","v":""},{"$f":"IF(ISBLANK('Data Input'!A124),\"\",COUNTIF('Data Input'!C124:AA124,\"0\"))","v":""},{"$f":"IF(ISBLANK('Data Input'!A124),\"\",SUM(B119,C119))","v":""},{"$f":"IF(ISBLANK('Data Input'!A124),\"\",SUM('Data Input'!C124:AA124))","v":""},{"$f":"IF(E119=\"\",\"\",E119/(COUNTA('Data Input'!$C$8:$AA$8)))","v":""},{"$f":"IF(ISBLANK('Data Input'!A124),\"\",SUM('Data Input'!C124,'Data Input'!F124,'Data Input'!G124,'Data Input'!J124,'Data Input'!L124,'Data Input'!O124,'Data Input'!Q124,'Data Input'!R124,'Data Input'!U124))","v":""},{"$f":"IF(G119=\"\",\"\",G119/COUNTIF('Data Input'!$C$8:$AA$8,\"+\"))","v":""},{"$f":"IF(ISBLANK('Data Input'!A124),\"\",SUM('Data Input'!D124,'Data Input'!E124,'Data Input'!K124,'Data Input'!M124,'Data Input'!Y124))","v":""},{"$f":"IF(I119=\"\",\"\",I119/COUNTIF('Data Input'!$C$8:$AA$8,\"-\"))","v":""},{"$f":"IF(ISBLANK('Data Input'!A124),\"\",SUM('Data Input'!H124,'Data Input'!I124,'Data Input'!N124,'Data Input'!S124))","v":""},{"$f":"IF(K119=\"\",\"\",K119/COUNTIF('Data Input'!$C$8:$AA$8,\"x\"))","v":""},{"$f":"IF(ISBLANK('Data Input'!A124),\"\",SUM('Data Input'!P124,'Data Input'!V124,'Data Input'!W124))","v":""},{"$f":"IF(M119=\"\",\"\",M119/COUNTIF('Data Input'!$C$8:$AA$8,\"÷\"))","v":""},{"$f":"IF(ISBLANK('Data Input'!A124),\"\",SUM('Data Input'!T124,'Data Input'!X124,'Data Input'!Z124,'Data Input'!AA124))","v":""},{"$f":"IF(O119=\"\",\"\",O119/COUNTIF('Data Input'!$C$8:$AA$8,\"F\"))","v":""}]
[{"$f":"IF('Data Input'!A125=0,\"\",'Data Input'!A125)","v":""},{"$f":"IF(ISBLANK('Data Input'!A125),\"\",COUNTIF('Data Input'!C125:AA125,\"\"))","v":""},{"$f":"IF(ISBLANK('Data Input'!A125),\"\",COUNTIF('Data Input'!C125:AA125,\"0\"))","v":""},{"$f":"IF(ISBLANK('Data Input'!A125),\"\",SUM(B120,C120))","v":""},{"$f":"IF(ISBLANK('Data Input'!A125),\"\",SUM('Data Input'!C125:AA125))","v":""},{"$f":"IF(E120=\"\",\"\",E120/(COUNTA('Data Input'!$C$8:$AA$8)))","v":""},{"$f":"IF(ISBLANK('Data Input'!A125),\"\",SUM('Data Input'!C125,'Data Input'!F125,'Data Input'!G125,'Data Input'!J125,'Data Input'!L125,'Data Input'!O125,'Data Input'!Q125,'Data Input'!R125,'Data Input'!U125))","v":""},{"$f":"IF(G120=\"\",\"\",G120/COUNTIF('Data Input'!$C$8:$AA$8,\"+\"))","v":""},{"$f":"IF(ISBLANK('Data Input'!A125),\"\",SUM('Data Input'!D125,'Data Input'!E125,'Data Input'!K125,'Data Input'!M125,'Data Input'!Y125))","v":""},{"$f":"IF(I120=\"\",\"\",I120/COUNTIF('Data Input'!$C$8:$AA$8,\"-\"))","v":""},{"$f":"IF(ISBLANK('Data Input'!A125),\"\",SUM('Data Input'!H125,'Data Input'!I125,'Data Input'!N125,'Data Input'!S125))","v":""},{"$f":"IF(K120=\"\",\"\",K120/COUNTIF('Data Input'!$C$8:$AA$8,\"x\"))","v":""},{"$f":"IF(ISBLANK('Data Input'!A125),\"\",SUM('Data Input'!P125,'Data Input'!V125,'Data Input'!W125))","v":""},{"$f":"IF(M120=\"\",\"\",M120/COUNTIF('Data Input'!$C$8:$AA$8,\"÷\"))","v":""},{"$f":"IF(ISBLANK('Data Input'!A125),\"\",SUM('Data Input'!T125,'Data Input'!X125,'Data Input'!Z125,'Data Input'!AA125))","v":""},{"$f":"IF(O120=\"\",\"\",O120/COUNTIF('Data Input'!$C$8:$AA$8,\"F\"))","v":""}]
[{"$f":"IF('Data Input'!A126=0,\"\",'Data Input'!A126)","v":""},{"$f":"IF(ISBLANK('Data Input'!A126),\"\",COUNTIF('Data Input'!C126:AA126,\"\"))","v":""},{"$f":"IF(ISBLANK('Data Input'!A126),\"\",COUNTIF('Data Input'!C126:AA126,\"0\"))","v":""},{"$f":"IF(ISBLANK('Data Input'!A126),\"\",SUM(B121,C121))","v":""},{"$f":"IF(ISBLANK('Data Input'!A126),\"\",SUM('Data Input'!C126:AA126))","v":""},{"$f":"IF(E121=\"\",\"\",E121/(COUNTA('Data Input'!$C$8:$AA$8)))","v":""},{"$f":"IF(ISBLANK('Data Input'!A126),\"\",SUM('Data Input'!C126,'Data Input'!F126,'Data Input'!G126,'Data Input'!J126,'Data Input'!L126,'Data Input'!O126,'Data Input'!Q126,'Data Input'!R126,'Data Input'!U126))","v":""},{"$f":"IF(G121=\"\",\"\",G121/COUNTIF('Data Input'!$C$8:$AA$8,\"+\"))","v":""},{"$f":"IF(ISBLANK('Data Input'!A126),\"\",SUM('Data Input'!D126,'Data Input'!E126,'Data Input'!K126,'Data Input'!M126,'Data Input'!Y126))","v":""},{"$f":"IF(I121=\"\",\"\",I121/COUNTIF('Data Input'!$C$8:$AA$8,\"-\"))","v":""},{"$f":"IF(ISBLANK('Data Input'!A126),\"\",SUM('Data Input'!H126,'Data Input'!I126,'Data Input'!N126,'Data Input'!S126))","v":""},{"$f":"IF(K121=\"\",\"\",K121/COUNTIF('Data Input'!$C$8:$AA$8,\"x\"))","v":""},{"$f":"IF(ISBLANK('Data Input'!A126),\"\",SUM('Data Input'!P126,'Data Input'!V126,'Data Input'!W126))","v":""},{"$f":"IF(M121=\"\",\"\",M121/COUNTIF('Data Input'!$C$8:$AA$8,\"÷\"))","v":""},{"$f":"IF(ISBLANK('Data Input'!A126),\"\",SUM('Data Input'!T126,'Data Input'!X126,'Data Input'!Z126,'Data Input'!AA126))","v":""},{"$f":"IF(O121=\"\",\"\",O121/COUNTIF('Data Input'!$C$8:$AA$8,\"F\"))","v":""}]
[{"$f":"IF('Data Input'!A127=0,\"\",'Data Input'!A127)","v":""},{"$f":"IF(ISBLANK('Data Input'!A127),\"\",COUNTIF('Data Input'!C127:AA127,\"\"))","v":""},{"$f":"IF(ISBLANK('Data Input'!A127),\"\",COUNTIF('Data Input'!C127:AA127,\"0\"))","v":""},{"$f":"IF(ISBLANK('Data Input'!A127),\"\",SUM(B122,C122))","v":""},{"$f":"IF(ISBLANK('Data Input'!A127),\"\",SUM('Data Input'!C127:AA127))","v":""},{"$f":"IF(E122=\"\",\"\",E122/(COUNTA('Data Input'!$C$8:$AA$8)))","v":""},{"$f":"IF(ISBLANK('Data Input'!A127),\"\",SUM('Data Input'!C127,'Data Input'!F127,'Data Input'!G127,'Data Input'!J127,'Data Input'!L127,'Data Input'!O127,'Data Input'!Q127,'Data Input'!R127,'Data Input'!U127))","v":""},{"$f":"IF(G122=\"\",\"\",G122/COUNTIF('Data Input'!$C$8:$AA$8,\"+\"))","v":""},{"$f":"IF(ISBLANK('Data Input'!A127),\"\",SUM('Data Input'!D127,'Data Input'!E127,'Data Input'!K127,'Data Input'!M127,'Data Input'!Y127))","v":""},{"$f":"IF(I122=\"\",\"\",I122/COUNTIF('Data Input'!$C$8:$AA$8,\"-\"))","v":""},{"$f":"IF(ISBLANK('Data Input'!A127),\"\",SUM('Data Input'!H127,'Data Input'!I127,'Data Input'!N127,'Data Input'!S127))","v":""},{"$f":"IF(K122=\"\",\"\",K122/COUNTIF('Data Input'!$C$8:$AA$8,\"x\"))","v":""},{"$f":"IF(ISBLANK('Data Input'!A127),\"\",SUM('Data Input'!P127,'Data Input'!V127,'Data Input'!W127))","v":""},{"$f":"IF(M122=\"\",\"\",M122/COUNTIF('Data Input'!$C$8:$AA$8,\"÷\"))","v":""},{"$f":"IF(ISBLANK('Data Input'!A127),\"\",SUM('Data Input'!T127,'Data Input'!X127,'Data Input'!Z127,'Data Input'!AA127))","v":""},{"$f":"IF(O122=\"\",\"\",O122/COUNTIF('Data Input'!$C$8:$AA$8,\"F\"))","v":""}]
[{"$f":"IF('Data Input'!A128=0,\"\",'Data Input'!A128)","v":""},{"$f":"IF(ISBLANK('Data Input'!A128),\"\",COUNTIF('Data Input'!C128:AA128,\"\"))","v":""},{"$f":"IF(ISBLANK('Data Input'!A128),\"\",COUNTIF('Data Input'!C128:AA128,\"0\"))","v":""},{"$f":"IF(ISBLANK('Data Input'!A128),\"\",SUM(B123,C123))","v":""},{"$f":"IF(ISBLANK('Data Input'!A128),\"\",SUM('Data Input'!C128:AA128))","v":""},{"$f":"IF(E123=\"\",\"\",E123/(COUNTA('Data Input'!$C$8:$AA$8)))","v":""},{"$f":"IF(ISBLANK('Data Input'!A128),\"\",SUM('Data Input'!C128,'Data Input'!F128,'Data Input'!G128,'Data Input'!J128,'Data Input'!L128,'Data Input'!O128,'Data Input'!Q128,'Data Input'!R128,'Data Input'!U128))","v":""},{"$f":"IF(G123=\"\",\"\",G123/COUNTIF('Data Input'!$C$8:$AA$8,\"+\"))","v":""},{"$f":"IF(ISBLANK('Data Input'!A128),\"\",SUM('Data Input'!D128,'Data Input'!E128,'Data Input'!K128,'Data Input'!M128,'Data Input'!Y128))","v":""},{"$f":"IF(I123=\"\",\"\",I123/COUNTIF('Data Input'!$C$8:$AA$8,\"-\"))","v":""},{"$f":"IF(ISBLANK('Data Input'!A128),\"\",SUM('Data Input'!H128,'Data Input'!I128,'Data Input'!N128,'Data Input'!S128))","v":""},{"$f":"IF(K123=\"\",\"\",K123/COUNTIF('Data Input'!$C$8:$AA$8,\"x\"))","v":""},{"$f":"IF(ISBLANK('Data Input'!A128),\"\",SUM('Data Input'!P128,'Data Input'!V128,'Data Input'!W128))","v":""},{"$f":"IF(M123=\"\",\"\",M123/COUNTIF('Data Input'!$C$8:$AA$8,\"÷\"))","v":""},{"$f":"IF(ISBLANK('Data Input'!A128),\"\",SUM('Data Input'!T128,'Data Input'!X128,'Data Input'!Z128,'Data Input'!AA128))","v":""},{"$f":"IF(O123=\"\",\"\",O123/COUNTIF('Data Input'!$C$8:$AA$8,\"F\"))","v":""}]
[{"$f":"IF('Data Input'!A129=0,\"\",'Data Input'!A129)","v":""},{"$f":"IF(ISBLANK('Data Input'!A129),\"\",COUNTIF('Data Input'!C129:AA129,\"\"))","v":""},{"$f":"IF(ISBLANK('Data Input'!A129),\"\",COUNTIF('Data Input'!C129:AA129,\"0\"))","v":""},{"$f":"IF(ISBLANK('Data Input'!A129),\"\",SUM(B124,C124))","v":""},{"$f":"IF(ISBLANK('Data Input'!A129),\"\",SUM('Data Input'!C129:AA129))","v":""},{"$f":"IF(E124=\"\",\"\",E124/(COUNTA('Data Input'!$C$8:$AA$8)))","v":""},{"$f":"IF(ISBLANK('Data Input'!A129),\"\",SUM('Data Input'!C129,'Data Input'!F129,'Data Input'!G129,'Data Input'!J129,'Data Input'!L129,'Data Input'!O129,'Data Input'!Q129,'Data Input'!R129,'Data Input'!U129))","v":""},{"$f":"IF(G124=\"\",\"\",G124/COUNTIF('Data Input'!$C$8:$AA$8,\"+\"))","v":""},{"$f":"IF(ISBLANK('Data Input'!A129),\"\",SUM('Data Input'!D129,'Data Input'!E129,'Data Input'!K129,'Data Input'!M129,'Data Input'!Y129))","v":""},{"$f":"IF(I124=\"\",\"\",I124/COUNTIF('Data Input'!$C$8:$AA$8,\"-\"))","v":""},{"$f":"IF(ISBLANK('Data Input'!A129),\"\",SUM('Data Input'!H129,'Data Input'!I129,'Data Input'!N129,'Data Input'!S129))","v":""},{"$f":"IF(K124=\"\",\"\",K124/COUNTIF('Data Input'!$C$8:$AA$8,\"x\"))","v":""},{"$f":"IF(ISBLANK('Data Input'!A129),\"\",SUM('Data Input'!P129,'Data Input'!V129,'Data Input'!W129))","v":""},{"$f":"IF(M124=\"\",\"\",M124/COUNTIF('Data Input'!$C$8:$AA$8,\"÷\"))","v":""},{"$f":"IF(ISBLANK('Data Input'!A129),\"\",SUM('Data Input'!T129,'Data Input'!X129,'Data Input'!Z129,'Data Input'!AA129))","v":""},{"$f":"IF(O124=\"\",\"\",O124/COUNTIF('Data Input'!$C$8:$AA$8,\"F\"))","v":""}]
[{"$f":"IF('Data Input'!A130=0,\"\",'Data Input'!A130)","v":""},{"$f":"IF(ISBLANK('Data Input'!A130),\"\",COUNTIF('Data Input'!C130:AA130,\"\"))","v":""},{"$f":"IF(ISBLANK('Data Input'!A130),\"\",COUNTIF('Data Input'!C130:AA130,\"0\"))","v":""},{"$f":"IF(ISBLANK('Data Input'!A130),\"\",SUM(B125,C125))","v":""},{"$f":"IF(ISBLANK('Data Input'!A130),\"\",SUM('Data Input'!C130:AA130))","v":""},{"$f":"IF(E125=\"\",\"\",E125/(COUNTA('Data Input'!$C$8:$AA$8)))","v":""},{"$f":"IF(ISBLANK('Data Input'!A130),\"\",SUM('Data Input'!C130,'Data Input'!F130,'Data Input'!G130,'Data Input'!J130,'Data Input'!L130,'Data Input'!O130,'Data Input'!Q130,'Data Input'!R130,'Data Input'!U130))","v":""},{"$f":"IF(G125=\"\",\"\",G125/COUNTIF('Data Input'!$C$8:$AA$8,\"+\"))","v":""},{"$f":"IF(ISBLANK('Data Input'!A130),\"\",SUM('Data Input'!D130,'Data Input'!E130,'Data Input'!K130,'Data Input'!M130,'Data Input'!Y130))","v":""},{"$f":"IF(I125=\"\",\"\",I125/COUNTIF('Data Input'!$C$8:$AA$8,\"-\"))","v":""},{"$f":"IF(ISBLANK('Data Input'!A130),\"\",SUM('Data Input'!H130,'Data Input'!I130,'Data Input'!N130,'Data Input'!S130))","v":""},{"$f":"IF(K125=\"\",\"\",K125/COUNTIF('Data Input'!$C$8:$AA$8,\"x\"))","v":""},{"$f":"IF(ISBLANK('Data Input'!A130),\"\",SUM('Data Input'!P130,'Data Input'!V130,'Data Input'!W130))","v":""},{"$f":"IF(M125=\"\",\"\",M125/COUNTIF('Data Input'!$C$8:$AA$8,\"÷\"))","v":""},{"$f":"IF(ISBLANK('Data Input'!A130),\"\",SUM('Data Input'!T130,'Data Input'!X130,'Data Input'!Z130,'Data Input'!AA130))","v":""},{"$f":"IF(O125=\"\",\"\",O125/COUNTIF('Data Input'!$C$8:$AA$8,\"F\"))","v":""}]
[{"$f":"IF('Data Input'!A131=0,\"\",'Data Input'!A131)","v":""},{"$f":"IF(ISBLANK('Data Input'!A131),\"\",COUNTIF('Data Input'!C131:AA131,\"\"))","v":""},{"$f":"IF(ISBLANK('Data Input'!A131),\"\",COUNTIF('Data Input'!C131:AA131,\"0\"))","v":""},{"$f":"IF(ISBLANK('Data Input'!A131),\"\",SUM(B126,C126))","v":""},{"$f":"IF(ISBLANK('Data Input'!A131),\"\",SUM('Data Input'!C131:AA131))","v":""},{"$f":"IF(E126=\"\",\"\",E126/(COUNTA('Data Input'!$C$8:$AA$8)))","v":""},{"$f":"IF(ISBLANK('Data Input'!A131),\"\",SUM('Data Input'!C131,'Data Input'!F131,'Data Input'!G131,'Data Input'!J131,'Data Input'!L131,'Data Input'!O131,'Data Input'!Q131,'Data Input'!R131,'Data Input'!U131))","v":""},{"$f":"IF(G126=\"\",\"\",G126/COUNTIF('Data Input'!$C$8:$AA$8,\"+\"))","v":""},{"$f":"IF(ISBLANK('Data Input'!A131),\"\",SUM('Data Input'!D131,'Data Input'!E131,'Data Input'!K131,'Data Input'!M131,'Data Input'!Y131))","v":""},{"$f":"IF(I126=\"\",\"\",I126/COUNTIF('Data Input'!$C$8:$AA$8,\"-\"))","v":""},{"$f":"IF(ISBLANK('Data Input'!A131),\"\",SUM('Data Input'!H131,'Data Input'!I131,'Data Input'!N131,'Data Input'!S131))","v":""},{"$f":"IF(K126=\"\",\"\",K126/COUNTIF('Data Input'!$C$8:$AA$8,\"x\"))","v":""},{"$f":"IF(ISBLANK('Data Input'!A131),\"\",SUM('Data Input'!P131,'Data Input'!V131,'Data Input'!W131))","v":""},{"$f":"IF(M126=\"\",\"\",M126/COUNTIF('Data Input'!$C$8:$AA$8,\"÷\"))","v":""},{"$f":"IF(ISBLANK('Data Input'!A131),\"\",SUM('Data Input'!T131,'Data Input'!X131,'Data Input'!Z131,'Data Input'!AA131))","v":""},{"$f":"IF(O126=\"\",\"\",O126/COUNTIF('Data Input'!$C$8:$AA$8,\"F\"))","v":""}]
[{"$f":"IF('Data Input'!A132=0,\"\",'Data Input'!A132)","v":""},{"$f":"IF(ISBLANK('Data Input'!A132),\"\",COUNTIF('Data Input'!C132:AA132,\"\"))","v":""},{"$f":"IF(ISBLANK('Data Input'!A132),\"\",COUNTIF('Data Input'!C132:AA132,\"0\"))","v":""},{"$f":"IF(ISBLANK('Data Input'!A132),\"\",SUM(B127,C127))","v":""},{"$f":"IF(ISBLANK('Data Input'!A132),\"\",SUM('Data Input'!C132:AA132))","v":""},{"$f":"IF(E127=\"\",\"\",E127/(COUNTA('Data Input'!$C$8:$AA$8)))","v":""},{"$f":"IF(ISBLANK('Data Input'!A132),\"\",SUM('Data Input'!C132,'Data Input'!F132,'Data Input'!G132,'Data Input'!J132,'Data Input'!L132,'Data Input'!O132,'Data Input'!Q132,'Data Input'!R132,'Data Input'!U132))","v":""},{"$f":"IF(G127=\"\",\"\",G127/COUNTIF('Data Input'!$C$8:$AA$8,\"+\"))","v":""},{"$f":"IF(ISBLANK('Data Input'!A132),\"\",SUM('Data Input'!D132,'Data Input'!E132,'Data Input'!K132,'Data Input'!M132,'Data Input'!Y132))","v":""},{"$f":"IF(I127=\"\",\"\",I127/COUNTIF('Data Input'!$C$8:$AA$8,\"-\"))","v":""},{"$f":"IF(ISBLANK('Data Input'!A132),\"\",SUM('Data Input'!H132,'Data Input'!I132,'Data Input'!N132,'Data Input'!S132))","v":""},{"$f":"IF(K127=\"\",\"\",K127/COUNTIF('Data Input'!$C$8:$AA$8,\"x\"))","v":""},{"$f":"IF(ISBLANK('Data Input'!A132),\"\",SUM('Data Input'!P132,'Data Input'!V132,'Data Input'!W132))","v":""},{"$f":"IF(M127=\"\",\"\",M127/COUNTIF('Data Input'!$C$8:$AA$8,\"÷\"))","v":""},{"$f":"IF(ISBLANK('Data Input'!A132),\"\",SUM('Data Input'!T132,'Data Input'!X132,'Data Input'!Z132,'Data Input'!AA132))","v":""},{"$f":"IF(O127=\"\",\"\",O127/COUNTIF('Data Input'!$C$8:$AA$8,\"F\"))","v":""}]
[{"$f":"IF('Data Input'!A133=0,\"\",'Data Input'!A133)","v":""},{"$f":"IF(ISBLANK('Data Input'!A133),\"\",COUNTIF('Data Input'!C133:AA133,\"\"))","v":""},{"$f":"IF(ISBLANK('Data Input'!A133),\"\",COUNTIF('Data Input'!C133:AA133,\"0\"))","v":""},{"$f":"IF(ISBLANK('Data Input'!A133),\"\",SUM(B128,C128))","v":""},{"$f":"IF(ISBLANK('Data Input'!A133),\"\",SUM('Data Input'!C133:AA133))","v":""},{"$f":"IF(E128=\"\",\"\",E128/(COUNTA('Data Input'!$C$8:$AA$8)))","v":""},{"$f":"IF(ISBLANK('Data Input'!A133),\"\",SUM('Data Input'!C133,'Data Input'!F133,'Data Input'!G133,'Data Input'!J133,'Data Input'!L133,'Data Input'!O133,'Data Input'!Q133,'Data Input'!R133,'Data Input'!U133))","v":""},{"$f":"IF(G128=\"\",\"\",G128/COUNTIF('Data Input'!$C$8:$AA$8,\"+\"))","v":""},{"$f":"IF(ISBLANK('Data Input'!A133),\"\",SUM('Data Input'!D133,'Data Input'!E133,'Data Input'!K133,'Data Input'!M133,'Data Input'!Y133))","v":""},{"$f":"IF(I128=\"\",\"\",I128/COUNTIF('Data Input'!$C$8:$AA$8,\"-\"))","v":""},{"$f":"IF(ISBLANK('Data Input'!A133),\"\",SUM('Data Input'!H133,'Data Input'!I133,'Data Input'!N133,'Data Input'!S133))","v":""},{"$f":"IF(K128=\"\",\"\",K128/COUNTIF('Data Input'!$C$8:$AA$8,\"x\"))","v":""},{"$f":"IF(ISBLANK('Data Input'!A133),\"\",SUM('Data Input'!P133,'Data Input'!V133,'Data Input'!W133))","v":""},{"$f":"IF(M128=\"\",\"\",M128/COUNTIF('Data Input'!$C$8:$AA$8,\"÷\"))","v":""},{"$f":"IF(ISBLANK('Data Input'!A133),\"\",SUM('Data Input'!T133,'Data Input'!X133,'Data Input'!Z133,'Data Input'!AA133))","v":""},{"$f":"IF(O128=\"\",\"\",O128/COUNTIF('Data Input'!$C$8:$AA$8,\"F\"))","v":""}]
[{"$f":"IF('Data Input'!A134=0,\"\",'Data Input'!A134)","v":""},{"$f":"IF(ISBLANK('Data Input'!A134),\"\",COUNTIF('Data Input'!C134:AA134,\"\"))","v":""},{"$f":"IF(ISBLANK('Data Input'!A134),\"\",COUNTIF('Data Input'!C134:AA134,\"0\"))","v":""},{"$f":"IF(ISBLANK('Data Input'!A134),\"\",SUM(B129,C129))","v":""},{"$f":"IF(ISBLANK('Data Input'!A134),\"\",SUM('Data Input'!C134:AA134))","v":""},{"$f":"IF(E129=\"\",\"\",E129/(COUNTA('Data Input'!$C$8:$AA$8)))","v":""},{"$f":"IF(ISBLANK('Data Input'!A134),\"\",SUM('Data Input'!C134,'Data Input'!F134,'Data Input'!G134,'Data Input'!J134,'Data Input'!L134,'Data Input'!O134,'Data Input'!Q134,'Data Input'!R134,'Data Input'!U134))","v":""},{"$f":"IF(G129=\"\",\"\",G129/COUNTIF('Data Input'!$C$8:$AA$8,\"+\"))","v":""},{"$f":"IF(ISBLANK('Data Input'!A134),\"\",SUM('Data Input'!D134,'Data Input'!E134,'Data Input'!K134,'Data Input'!M134,'Data Input'!Y134))","v":""},{"$f":"IF(I129=\"\",\"\",I129/COUNTIF('Data Input'!$C$8:$AA$8,\"-\"))","v":""},{"$f":"IF(ISBLANK('Data Input'!A134),\"\",SUM('Data Input'!H134,'Data Input'!I134,'Data Input'!N134,'Data Input'!S134))","v":""},{"$f":"IF(K129=\"\",\"\",K129/COUNTIF('Data Input'!$C$8:$AA$8,\"x\"))","v":""},{"$f":"IF(ISBLANK('Data Input'!A134),\"\",SUM('Data Input'!P134,'Data Input'!V134,'Data Input'!W134))","v":""},{"$f":"IF(M129=\"\",\"\",M129/COUNTIF('Data Input'!$C$8:$AA$8,\"÷\"))","v":""},{"$f":"IF(ISBLANK('Data Input'!A134),\"\",SUM('Data Input'!T134,'Data Input'!X134,'Data Input'!Z134,'Data Input'!AA134))","v":""},{"$f":"IF(O129=\"\",\"\",O129/COUNTIF('Data Input'!$C$8:$AA$8,\"F\"))","v":""}]
[{"$f":"IF('Data Input'!A135=0,\"\",'Data Input'!A135)","v":""},{"$f":"IF(ISBLANK('Data Input'!A135),\"\",COUNTIF('Data Input'!C135:AA135,\"\"))","v":""},{"$f":"IF(ISBLANK('Data Input'!A135),\"\",COUNTIF('Data Input'!C135:AA135,\"0\"))","v":""},{"$f":"IF(ISBLANK('Data Input'!A135),\"\",SUM(B130,C130))","v":""},{"$f":"IF(ISBLANK('Data Input'!A135),\"\",SUM('Data Input'!C135:AA135))","v":""},{"$f":"IF(E130=\"\",\"\",E130/(COUNTA('Data Input'!$C$8:$AA$8)))","v":""},{"$f":"IF(ISBLANK('Data Input'!A135),\"\",SUM('Data Input'!C135,'Data Input'!F135,'Data Input'!G135,'Data Input'!J135,'Data Input'!L135,'Data Input'!O135,'Data Input'!Q135,'Data Input'!R135,'Data Input'!U135))","v":""},{"$f":"IF(G130=\"\",\"\",G130/COUNTIF('Data Input'!$C$8:$AA$8,\"+\"))","v":""},{"$f":"IF(ISBLANK('Data Input'!A135),\"\",SUM('Data Input'!D135,'Data Input'!E135,'Data Input'!K135,'Data Input'!M135,'Data Input'!Y135))","v":""},{"$f":"IF(I130=\"\",\"\",I130/COUNTIF('Data Input'!$C$8:$AA$8,\"-\"))","v":""},{"$f":"IF(ISBLANK('Data Input'!A135),\"\",SUM('Data Input'!H135,'Data Input'!I135,'Data Input'!N135,'Data Input'!S135))","v":""},{"$f":"IF(K130=\"\",\"\",K130/COUNTIF('Data Input'!$C$8:$AA$8,\"x\"))","v":""},{"$f":"IF(ISBLANK('Data Input'!A135),\"\",SUM('Data Input'!P135,'Data Input'!V135,'Data Input'!W135))","v":""},{"$f":"IF(M130=\"\",\"\",M130/COUNTIF('Data Input'!$C$8:$AA$8,\"÷\"))","v":""},{"$f":"IF(ISBLANK('Data Input'!A135),\"\",SUM('Data Input'!T135,'Data Input'!X135,'Data Input'!Z135,'Data Input'!AA135))","v":""},{"$f":"IF(O130=\"\",\"\",O130/COUNTIF('Data Input'!$C$8:$AA$8,\"F\"))","v":""}]
[{"$f":"IF('Data Input'!A136=0,\"\",'Data Input'!A136)","v":""},{"$f":"IF(ISBLANK('Data Input'!A136),\"\",COUNTIF('Data Input'!C136:AA136,\"\"))","v":""},{"$f":"IF(ISBLANK('Data Input'!A136),\"\",COUNTIF('Data Input'!C136:AA136,\"0\"))","v":""},{"$f":"IF(ISBLANK('Data Input'!A136),\"\",SUM(B131,C131))","v":""},{"$f":"IF(ISBLANK('Data Input'!A136),\"\",SUM('Data Input'!C136:AA136))","v":""},{"$f":"IF(E131=\"\",\"\",E131/(COUNTA('Data Input'!$C$8:$AA$8)))","v":""},{"$f":"IF(ISBLANK('Data Input'!A136),\"\",SUM('Data Input'!C136,'Data Input'!F136,'Data Input'!G136,'Data Input'!J136,'Data Input'!L136,'Data Input'!O136,'Data Input'!Q136,'Data Input'!R136,'Data Input'!U136))","v":""},{"$f":"IF(G131=\"\",\"\",G131/COUNTIF('Data Input'!$C$8:$AA$8,\"+\"))","v":""},{"$f":"IF(ISBLANK('Data Input'!A136),\"\",SUM('Data Input'!D136,'Data Input'!E136,'Data Input'!K136,'Data Input'!M136,'Data Input'!Y136))","v":""},{"$f":"IF(I131=\"\",\"\",I131/COUNTIF('Data Input'!$C$8:$AA$8,\"-\"))","v":""},{"$f":"IF(ISBLANK('Data Input'!A136),\"\",SUM('Data Input'!H136,'Data Input'!I136,'Data Input'!N136,'Data Input'!S136))","v":""},{"$f":"IF(K131=\"\",\"\",K131/COUNTIF('Data Input'!$C$8:$AA$8,\"x\"))","v":""},{"$f":"IF(ISBLANK('Data Input'!A136),\"\",SUM('Data Input'!P136,'Data Input'!V136,'Data Input'!W136))","v":""},{"$f":"IF(M131=\"\",\"\",M131/COUNTIF('Data Input'!$C$8:$AA$8,\"÷\"))","v":""},{"$f":"IF(ISBLANK('Data Input'!A136),\"\",SUM('Data Input'!T136,'Data Input'!X136,'Data Input'!Z136,'Data Input'!AA136))","v":""},{"$f":"IF(O131=\"\",\"\",O131/COUNTIF('Data Input'!$C$8:$AA$8,\"F\"))","v":""}]
[{"$f":"IF('Data Input'!A137=0,\"\",'Data Input'!A137)","v":""},{"$f":"IF(ISBLANK('Data Input'!A137),\"\",COUNTIF('Data Input'!C137:AA137,\"\"))","v":""},{"$f":"IF(ISBLANK('Data Input'!A137),\"\",COUNTIF('Data Input'!C137:AA137,\"0\"))","v":""},{"$f":"IF(ISBLANK('Data Input'!A137),\"\",SUM(B132,C132))","v":""},{"$f":"IF(ISBLANK('Data Input'!A137),\"\",SUM('Data Input'!C137:AA137))","v":""},{"$f":"IF(E132=\"\",\"\",E132/(COUNTA('Data Input'!$C$8:$AA$8)))","v":""},{"$f":"IF(ISBLANK('Data Input'!A137),\"\",SUM('Data Input'!C137,'Data Input'!F137,'Data Input'!G137,'Data Input'!J137,'Data Input'!L137,'Data Input'!O137,'Data Input'!Q137,'Data Input'!R137,'Data Input'!U137))","v":""},{"$f":"IF(G132=\"\",\"\",G132/COUNTIF('Data Input'!$C$8:$AA$8,\"+\"))","v":""},{"$f":"IF(ISBLANK('Data Input'!A137),\"\",SUM('Data Input'!D137,'Data Input'!E137,'Data Input'!K137,'Data Input'!M137,'Data Input'!Y137))","v":""},{"$f":"IF(I132=\"\",\"\",I132/COUNTIF('Data Input'!$C$8:$AA$8,\"-\"))","v":""},{"$f":"IF(ISBLANK('Data Input'!A137),\"\",SUM('Data Input'!H137,'Data Input'!I137,'Data Input'!N137,'Data Input'!S137))","v":""},{"$f":"IF(K132=\"\",\"\",K132/COUNTIF('Data Input'!$C$8:$AA$8,\"x\"))","v":""},{"$f":"IF(ISBLANK('Data Input'!A137),\"\",SUM('Data Input'!P137,'Data Input'!V137,'Data Input'!W137))","v":""},{"$f":"IF(M132=\"\",\"\",M132/COUNTIF('Data Input'!$C$8:$AA$8,\"÷\"))","v":""},{"$f":"IF(ISBLANK('Data Input'!A137),\"\",SUM('Data Input'!T137,'Data Input'!X137,'Data Input'!Z137,'Data Input'!AA137))","v":""},{"$f":"IF(O132=\"\",\"\",O132/COUNTIF('Data Input'!$C$8:$AA$8,\"F\"))","v":""}]
[{"$f":"IF('Data Input'!A138=0,\"\",'Data Input'!A138)","v":""},{"$f":"IF(ISBLANK('Data Input'!A138),\"\",COUNTIF('Data Input'!C138:AA138,\"\"))","v":""},{"$f":"IF(ISBLANK('Data Input'!A138),\"\",COUNTIF('Data Input'!C138:AA138,\"0\"))","v":""},{"$f":"IF(ISBLANK('Data Input'!A138),\"\",SUM(B133,C133))","v":""},{"$f":"IF(ISBLANK('Data Input'!A138),\"\",SUM('Data Input'!C138:AA138))","v":""},{"$f":"IF(E133=\"\",\"\",E133/(COUNTA('Data Input'!$C$8:$AA$8)))","v":""},{"$f":"IF(ISBLANK('Data Input'!A138),\"\",SUM('Data Input'!C138,'Data Input'!F138,'Data Input'!G138,'Data Input'!J138,'Data Input'!L138,'Data Input'!O138,'Data Input'!Q138,'Data Input'!R138,'Data Input'!U138))","v":""},{"$f":"IF(G133=\"\",\"\",G133/COUNTIF('Data Input'!$C$8:$AA$8,\"+\"))","v":""},{"$f":"IF(ISBLANK('Data Input'!A138),\"\",SUM('Data Input'!D138,'Data Input'!E138,'Data Input'!K138,'Data Input'!M138,'Data Input'!Y138))","v":""},{"$f":"IF(I133=\"\",\"\",I133/COUNTIF('Data Input'!$C$8:$AA$8,\"-\"))","v":""},{"$f":"IF(ISBLANK('Data Input'!A138),\"\",SUM('Data Input'!H138,'Data Input'!I138,'Data Input'!N138,'Data Input'!S138))","v":""},{"$f":"IF(K133=\"\",\"\",K133/COUNTIF('Data Input'!$C$8:$AA$8,\"x\"))","v":""},{"$f":"IF(ISBLANK('Data Input'!A138),\"\",SUM('Data Input'!P138,'Data Input'!V138,'Data Input'!W138))","v":""},{"$f":"IF(M133=\"\",\"\",M133/COUNTIF('Data Input'!$C$8:$AA$8,\"÷\"))","v":""},{"$f":"IF(ISBLANK('Data Input'!A138),\"\",SUM('Data Input'!T138,'Data Input'!X138,'Data Input'!Z138,'Data Input'!AA138))","v":""},{"$f":"IF(O133=\"\",\"\",O133/COUNTIF('Data Input'!$C$8:$AA$8,\"F\"))","v":""}]
[{"$f":"IF('Data Input'!A139=0,\"\",'Data Input'!A139)","v":""},{"$f":"IF(ISBLANK('Data Input'!A139),\"\",COUNTIF('Data Input'!C139:AA139,\"\"))","v":""},{"$f":"IF(ISBLANK('Data Input'!A139),\"\",COUNTIF('Data Input'!C139:AA139,\"0\"))","v":""},{"$f":"IF(ISBLANK('Data Input'!A139),\"\",SUM(B134,C134))","v":""},{"$f":"IF(ISBLANK('Data Input'!A139),\"\",SUM('Data Input'!C139:AA139))","v":""},{"$f":"IF(E134=\"\",\"\",E134/(COUNTA('Data Input'!$C$8:$AA$8)))","v":""},{"$f":"IF(ISBLANK('Data Input'!A139),\"\",SUM('Data Input'!C139,'Data Input'!F139,'Data Input'!G139,'Data Input'!J139,'Data Input'!L139,'Data Input'!O139,'Data Input'!Q139,'Data Input'!R139,'Data Input'!U139))","v":""},{"$f":"IF(G134=\"\",\"\",G134/COUNTIF('Data Input'!$C$8:$AA$8,\"+\"))","v":""},{"$f":"IF(ISBLANK('Data Input'!A139),\"\",SUM('Data Input'!D139,'Data Input'!E139,'Data Input'!K139,'Data Input'!M139,'Data Input'!Y139))","v":""},{"$f":"IF(I134=\"\",\"\",I134/COUNTIF('Data Input'!$C$8:$AA$8,\"-\"))","v":""},{"$f":"IF(ISBLANK('Data Input'!A139),\"\",SUM('Data Input'!H139,'Data Input'!I139,'Data Input'!N139,'Data Input'!S139))","v":""},{"$f":"IF(K134=\"\",\"\",K134/COUNTIF('Data Input'!$C$8:$AA$8,\"x\"))","v":""},{"$f":"IF(ISBLANK('Data Input'!A139),\"\",SUM('Data Input'!P139,'Data Input'!V139,'Data Input'!W139))","v":""},{"$f":"IF(M134=\"\",\"\",M134/COUNTIF('Data Input'!$C$8:$AA$8,\"÷\"))","v":""},{"$f":"IF(ISBLANK('Data Input'!A139),\"\",SUM('Data Input'!T139,'Data Input'!X139,'Data Input'!Z139,'Data Input'!AA139))","v":""},{"$f":"IF(O134=\"\",\"\",O134/COUNTIF('Data Input'!$C$8:$AA$8,\"F\"))","v":""}]
[{"$f":"IF('Data Input'!A140=0,\"\",'Data Input'!A140)","v":""},{"$f":"IF(ISBLANK('Data Input'!A140),\"\",COUNTIF('Data Input'!C140:AA140,\"\"))","v":""},{"$f":"IF(ISBLANK('Data Input'!A140),\"\",COUNTIF('Data Input'!C140:AA140,\"0\"))","v":""},{"$f":"IF(ISBLANK('Data Input'!A140),\"\",SUM(B135,C135))","v":""},{"$f":"IF(ISBLANK('Data Input'!A140),\"\",SUM('Data Input'!C140:AA140))","v":""},{"$f":"IF(E135=\"\",\"\",E135/(COUNTA('Data Input'!$C$8:$AA$8)))","v":""},{"$f":"IF(ISBLANK('Data Input'!A140),\"\",SUM('Data Input'!C140,'Data Input'!F140,'Data Input'!G140,'Data Input'!J140,'Data Input'!L140,'Data Input'!O140,'Data Input'!Q140,'Data Input'!R140,'Data Input'!U140))","v":""},{"$f":"IF(G135=\"\",\"\",G135/COUNTIF('Data Input'!$C$8:$AA$8,\"+\"))","v":""},{"$f":"IF(ISBLANK('Data Input'!A140),\"\",SUM('Data Input'!D140,'Data Input'!E140,'Data Input'!K140,'Data Input'!M140,'Data Input'!Y140))","v":""},{"$f":"IF(I135=\"\",\"\",I135/COUNTIF('Data Input'!$C$8:$AA$8,\"-\"))","v":""},{"$f":"IF(ISBLANK('Data Input'!A140),\"\",SUM('Data Input'!H140,'Data Input'!I140,'Data Input'!N140,'Data Input'!S140))","v":""},{"$f":"IF(K135=\"\",\"\",K135/COUNTIF('Data Input'!$C$8:$AA$8,\"x\"))","v":""},{"$f":"IF(ISBLANK('Data Input'!A140),\"\",SUM('Data Input'!P140,'Data Input'!V140,'Data Input'!W140))","v":""},{"$f":"IF(M135=\"\",\"\",M135/COUNTIF('Data Input'!$C$8:$AA$8,\"÷\"))","v":""},{"$f":"IF(ISBLANK('Data Input'!A140),\"\",SUM('Data Input'!T140,'Data Input'!X140,'Data Input'!Z140,'Data Input'!AA140))","v":""},{"$f":"IF(O135=\"\",\"\",O135/COUNTIF('Data Input'!$C$8:$AA$8,\"F\"))","v":""}]
[{"$f":"IF('Data Input'!A141=0,\"\",'Data Input'!A141)","v":""},{"$f":"IF(ISBLANK('Data Input'!A141),\"\",COUNTIF('Data Input'!C141:AA141,\"\"))","v":""},{"$f":"IF(ISBLANK('Data Input'!A141),\"\",COUNTIF('Data Input'!C141:AA141,\"0\"))","v":""},{"$f":"IF(ISBLANK('Data Input'!A141),\"\",SUM(B136,C136))","v":""},{"$f":"IF(ISBLANK('Data Input'!A141),\"\",SUM('Data Input'!C141:AA141))","v":""},{"$f":"IF(E136=\"\",\"\",E136/(COUNTA('Data Input'!$C$8:$AA$8)))","v":""},{"$f":"IF(ISBLANK('Data Input'!A141),\"\",SUM('Data Input'!C141,'Data Input'!F141,'Data Input'!G141,'Data Input'!J141,'Data Input'!L141,'Data Input'!O141,'Data Input'!Q141,'Data Input'!R141,'Data Input'!U141))","v":""},{"$f":"IF(G136=\"\",\"\",G136/COUNTIF('Data Input'!$C$8:$AA$8,\"+\"))","v":""},{"$f":"IF(ISBLANK('Data Input'!A141),\"\",SUM('Data Input'!D141,'Data Input'!E141,'Data Input'!K141,'Data Input'!M141,'Data Input'!Y141))","v":""},{"$f":"IF(I136=\"\",\"\",I136/COUNTIF('Data Input'!$C$8:$AA$8,\"-\"))","v":""},{"$f":"IF(ISBLANK('Data Input'!A141),\"\",SUM('Data Input'!H141,'Data Input'!I141,'Data Input'!N141,'Data Input'!S141))","v":""},{"$f":"IF(K136=\"\",\"\",K136/COUNTIF('Data Input'!$C$8:$AA$8,\"x\"))","v":""},{"$f":"IF(ISBLANK('Data Input'!A141),\"\",SUM('Data Input'!P141,'Data Input'!V141,'Data Input'!W141))","v":""},{"$f":"IF(M136=\"\",\"\",M136/COUNTIF('Data Input'!$C$8:$AA$8,\"÷\"))","v":""},{"$f":"IF(ISBLANK('Data Input'!A141),\"\",SUM('Data Input'!T141,'Data Input'!X141,'Data Input'!Z141,'Data Input'!AA141))","v":""},{"$f":"IF(O136=\"\",\"\",O136/COUNTIF('Data Input'!$C$8:$AA$8,\"F\"))","v":""}]
[{"$f":"IF('Data Input'!A142=0,\"\",'Data Input'!A142)","v":""},{"$f":"IF(ISBLANK('Data Input'!A142),\"\",COUNTIF('Data Input'!C142:AA142,\"\"))","v":""},{"$f":"IF(ISBLANK('Data Input'!A142),\"\",COUNTIF('Data Input'!C142:AA142,\"0\"))","v":""},{"$f":"IF(ISBLANK('Data Input'!A142),\"\",SUM(B137,C137))","v":""},{"$f":"IF(ISBLANK('Data Input'!A142),\"\",SUM('Data Input'!C142:AA142))","v":""},{"$f":"IF(E137=\"\",\"\",E137/(COUNTA('Data Input'!$C$8:$AA$8)))","v":""},{"$f":"IF(ISBLANK('Data Input'!A142),\"\",SUM('Data Input'!C142,'Data Input'!F142,'Data Input'!G142,'Data Input'!J142,'Data Input'!L142,'Data Input'!O142,'Data Input'!Q142,'Data Input'!R142,'Data Input'!U142))","v":""},{"$f":"IF(G137=\"\",\"\",G137/COUNTIF('Data Input'!$C$8:$AA$8,\"+\"))","v":""},{"$f":"IF(ISBLANK('Data Input'!A142),\"\",SUM('Data Input'!D142,'Data Input'!E142,'Data Input'!K142,'Data Input'!M142,'Data Input'!Y142))","v":""},{"$f":"IF(I137=\"\",\"\",I137/COUNTIF('Data Input'!$C$8:$AA$8,\"-\"))","v":""},{"$f":"IF(ISBLANK('Data Input'!A142),\"\",SUM('Data Input'!H142,'Data Input'!I142,'Data Input'!N142,'Data Input'!S142))","v":""},{"$f":"IF(K137=\"\",\"\",K137/COUNTIF('Data Input'!$C$8:$AA$8,\"x\"))","v":""},{"$f":"IF(ISBLANK('Data Input'!A142),\"\",SUM('Data Input'!P142,'Data Input'!V142,'Data Input'!W142))","v":""},{"$f":"IF(M137=\"\",\"\",M137/COUNTIF('Data Input'!$C$8:$AA$8,\"÷\"))","v":""},{"$f":"IF(ISBLANK('Data Input'!A142),\"\",SUM('Data Input'!T142,'Data Input'!X142,'Data Input'!Z142,'Data Input'!AA142))","v":""},{"$f":"IF(O137=\"\",\"\",O137/COUNTIF('Data Input'!$C$8:$AA$8,\"F\"))","v":""}]
[{"$f":"IF('Data Input'!A143=0,\"\",'Data Input'!A143)","v":""},{"$f":"IF(ISBLANK('Data Input'!A143),\"\",COUNTIF('Data Input'!C143:AA143,\"\"))","v":""},{"$f":"IF(ISBLANK('Data Input'!A143),\"\",COUNTIF('Data Input'!C143:AA143,\"0\"))","v":""},{"$f":"IF(ISBLANK('Data Input'!A143),\"\",SUM(B138,C138))","v":""},{"$f":"IF(ISBLANK('Data Input'!A143),\"\",SUM('Data Input'!C143:AA143))","v":""},{"$f":"IF(E138=\"\",\"\",E138/(COUNTA('Data Input'!$C$8:$AA$8)))","v":""},{"$f":"IF(ISBLANK('Data Input'!A143),\"\",SUM('Data Input'!C143,'Data Input'!F143,'Data Input'!G143,'Data Input'!J143,'Data Input'!L143,'Data Input'!O143,'Data Input'!Q143,'Data Input'!R143,'Data Input'!U143))","v":""},{"$f":"IF(G138=\"\",\"\",G138/COUNTIF('Data Input'!$C$8:$AA$8,\"+\"))","v":""},{"$f":"IF(ISBLANK('Data Input'!A143),\"\",SUM('Data Input'!D143,'Data Input'!E143,'Data Input'!K143,'Data Input'!M143,'Data Input'!Y143))","v":""},{"$f":"IF(I138=\"\",\"\",I138/COUNTIF('Data Input'!$C$8:$AA$8,\"-\"))","v":""},{"$f":"IF(ISBLANK('Data Input'!A143),\"\",SUM('Data Input'!H143,'Data Input'!I143,'Data Input'!N143,'Data Input'!S143))","v":""},{"$f":"IF(K138=\"\",\"\",K138/COUNTIF('Data Input'!$C$8:$AA$8,\"x\"))","v":""},{"$f":"IF(ISBLANK('Data Input'!A143),\"\",SUM('Data Input'!P143,'Data Input'!V143,'Data Input'!W143))","v":""},{"$f":"IF(M138=\"\",\"\",M138/COUNTIF('Data Input'!$C$8:$AA$8,\"÷\"))","v":""},{"$f":"IF(ISBLANK('Data Input'!A143),\"\",SUM('Data Input'!T143,'Data Input'!X143,'Data Input'!Z143,'Data Input'!AA143))","v":""},{"$f":"IF(O138=\"\",\"\",O138/COUNTIF('Data Input'!$C$8:$AA$8,\"F\"))","v":""}]
[{"$f":"IF('Data Input'!A144=0,\"\",'Data Input'!A144)","v":""},{"$f":"IF(ISBLANK('Data Input'!A144),\"\",COUNTIF('Data Input'!C144:AA144,\"\"))","v":""},{"$f":"IF(ISBLANK('Data Input'!A144),\"\",COUNTIF('Data Input'!C144:AA144,\"0\"))","v":""},{"$f":"IF(ISBLANK('Data Input'!A144),\"\",SUM(B139,C139))","v":""},{"$f":"IF(ISBLANK('Data Input'!A144),\"\",SUM('Data Input'!C144:AA144))","v":""},{"$f":"IF(E139=\"\",\"\",E139/(COUNTA('Data Input'!$C$8:$AA$8)))","v":""},{"$f":"IF(ISBLANK('Data Input'!A144),\"\",SUM('Data Input'!C144,'Data Input'!F144,'Data Input'!G144,'Data Input'!J144,'Data Input'!L144,'Data Input'!O144,'Data Input'!Q144,'Data Input'!R144,'Data Input'!U144))","v":""},{"$f":"IF(G139=\"\",\"\",G139/COUNTIF('Data Input'!$C$8:$AA$8,\"+\"))","v":""},{"$f":"IF(ISBLANK('Data Input'!A144),\"\",SUM('Data Input'!D144,'Data Input'!E144,'Data Input'!K144,'Data Input'!M144,'Data Input'!Y144))","v":""},{"$f":"IF(I139=\"\",\"\",I139/COUNTIF('Data Input'!$C$8:$AA$8,\"-\"))","v":""},{"$f":"IF(ISBLANK('Data Input'!A144),\"\",SUM('Data Input'!H144,'Data Input'!I144,'Data Input'!N144,'Data Input'!S144))","v":""},{"$f":"IF(K139=\"\",\"\",K139/COUNTIF('Data Input'!$C$8:$AA$8,\"x\"))","v":""},{"$f":"IF(ISBLANK('Data Input'!A144),\"\",SUM('Data Input'!P144,'Data Input'!V144,'Data Input'!W144))","v":""},{"$f":"IF(M139=\"\",\"\",M139/COUNTIF('Data Input'!$C$8:$AA$8,\"÷\"))","v":""},{"$f":"IF(ISBLANK('Data Input'!A144),\"\",SUM('Data Input'!T144,'Data Input'!X144,'Data Input'!Z144,'Data Input'!AA144))","v":""},{"$f":"IF(O139=\"\",\"\",O139/COUNTIF('Data Input'!$C$8:$AA$8,\"F\"))","v":""}]
[{"$f":"IF('Data Input'!A145=0,\"\",'Data Input'!A145)","v":""},{"$f":"IF(ISBLANK('Data Input'!A145),\"\",COUNTIF('Data Input'!C145:AA145,\"\"))","v":""},{"$f":"IF(ISBLANK('Data Input'!A145),\"\",COUNTIF('Data Input'!C145:AA145,\"0\"))","v":""},{"$f":"IF(ISBLANK('Data Input'!A145),\"\",SUM(B140,C140))","v":""},{"$f":"IF(ISBLANK('Data Input'!A145),\"\",SUM('Data Input'!C145:AA145))","v":""},{"$f":"IF(E140=\"\",\"\",E140/(COUNTA('Data Input'!$C$8:$AA$8)))","v":""},{"$f":"IF(ISBLANK('Data Input'!A145),\"\",SUM('Data Input'!C145,'Data Input'!F145,'Data Input'!G145,'Data Input'!J145,'Data Input'!L145,'Data Input'!O145,'Data Input'!Q145,'Data Input'!R145,'Data Input'!U145))","v":""},{"$f":"IF(G140=\"\",\"\",G140/COUNTIF('Data Input'!$C$8:$AA$8,\"+\"))","v":""},{"$f":"IF(ISBLANK('Data Input'!A145),\"\",SUM('Data Input'!D145,'Data Input'!E145,'Data Input'!K145,'Data Input'!M145,'Data Input'!Y145))","v":""},{"$f":"IF(I140=\"\",\"\",I140/COUNTIF('Data Input'!$C$8:$AA$8,\"-\"))","v":""},{"$f":"IF(ISBLANK('Data Input'!A145),\"\",SUM('Data Input'!H145,'Data Input'!I145,'Data Input'!N145,'Data Input'!S145))","v":""},{"$f":"IF(K140=\"\",\"\",K140/COUNTIF('Data Input'!$C$8:$AA$8,\"x\"))","v":""},{"$f":"IF(ISBLANK('Data Input'!A145),\"\",SUM('Data Input'!P145,'Data Input'!V145,'Data Input'!W145))","v":""},{"$f":"IF(M140=\"\",\"\",M140/COUNTIF('Data Input'!$C$8:$AA$8,\"÷\"))","v":""},{"$f":"IF(ISBLANK('Data Input'!A145),\"\",SUM('Data Input'!T145,'Data Input'!X145,'Data Input'!Z145,'Data Input'!AA145))","v":""},{"$f":"IF(O140=\"\",\"\",O140/COUNTIF('Data Input'!$C$8:$AA$8,\"F\"))","v":""}]
[{"$f":"IF('Data Input'!A146=0,\"\",'Data Input'!A146)","v":""},{"$f":"IF(ISBLANK('Data Input'!A146),\"\",COUNTIF('Data Input'!C146:AA146,\"\"))","v":""},{"$f":"IF(ISBLANK('Data Input'!A146),\"\",COUNTIF('Data Input'!C146:AA146,\"0\"))","v":""},{"$f":"IF(ISBLANK('Data Input'!A146),\"\",SUM(B141,C141))","v":""},{"$f":"IF(ISBLANK('Data Input'!A146),\"\",SUM('Data Input'!C146:AA146))","v":""},{"$f":"IF(E141=\"\",\"\",E141/(COUNTA('Data Input'!$C$8:$AA$8)))","v":""},{"$f":"IF(ISBLANK('Data Input'!A146),\"\",SUM('Data Input'!C146,'Data Input'!F146,'Data Input'!G146,'Data Input'!J146,'Data Input'!L146,'Data Input'!O146,'Data Input'!Q146,'Data Input'!R146,'Data Input'!U146))","v":""},{"$f":"IF(G141=\"\",\"\",G141/COUNTIF('Data Input'!$C$8:$AA$8,\"+\"))","v":""},{"$f":"IF(ISBLANK('Data Input'!A146),\"\",SUM('Data Input'!D146,'Data Input'!E146,'Data Input'!K146,'Data Input'!M146,'Data Input'!Y146))","v":""},{"$f":"IF(I141=\"\",\"\",I141/COUNTIF('Data Input'!$C$8:$AA$8,\"-\"))","v":""},{"$f":"IF(ISBLANK('Data Input'!A146),\"\",SUM('Data Input'!H146,'Data Input'!I146,'Data Input'!N146,'Data Input'!S146))","v":""},{"$f":"IF(K141=\"\",\"\",K141/COUNTIF('Data Input'!$C$8:$AA$8,\"x\"))","v":""},{"$f":"IF(ISBLANK('Data Input'!A146),\"\",SUM('Data Input'!P146,'Data Input'!V146,'Data Input'!W146))","v":""},{"$f":"IF(M141=\"\",\"\",M141/COUNTIF('Data Input'!$C$8:$AA$8,\"÷\"))","v":""},{"$f":"IF(ISBLANK('Data Input'!A146),\"\",SUM('Data Input'!T146,'Data Input'!X146,'Data Input'!Z146,'Data Input'!AA146))","v":""},{"$f":"IF(O141=\"\",\"\",O141/COUNTIF('Data Input'!$C$8:$AA$8,\"F\"))","v":""}]
[{"$f":"IF('Data Input'!A147=0,\"\",'Data Input'!A147)","v":""},{"$f":"IF(ISBLANK('Data Input'!A147),\"\",COUNTIF('Data Input'!C147:AA147,\"\"))","v":""},{"$f":"IF(ISBLANK('Data Input'!A147),\"\",COUNTIF('Data Input'!C147:AA147,\"0\"))","v":""},{"$f":"IF(ISBLANK('Data Input'!A147),\"\",SUM(B142,C142))","v":""},{"$f":"IF(ISBLANK('Data Input'!A147),\"\",SUM('Data Input'!C147:AA147))","v":""},{"$f":"IF(E142=\"\",\"\",E142/(COUNTA('Data Input'!$C$8:$AA$8)))","v":""},{"$f":"IF(ISBLANK('Data Input'!A147),\"\",SUM('Data Input'!C147,'Data Input'!F147,'Data Input'!G147,'Data Input'!J147,'Data Input'!L147,'Data Input'!O147,'Data Input'!Q147,'Data Input'!R147,'Data Input'!U147))","v":""},{"$f":"IF(G142=\"\",\"\",G142/COUNTIF('Data Input'!$C$8:$AA$8,\"+\"))","v":""},{"$f":"IF(ISBLANK('Data Input'!A147),\"\",SUM('Data Input'!D147,'Data Input'!E147,'Data Input'!K147,'Data Input'!M147,'Data Input'!Y147))","v":""},{"$f":"IF(I142=\"\",\"\",I142/COUNTIF('Data Input'!$C$8:$AA$8,\"-\"))","v":""},{"$f":"IF(ISBLANK('Data Input'!A147),\"\",SUM('Data Input'!H147,'Data Input'!I147,'Data Input'!N147,'Data Input'!S147))","v":""},{"$f":"IF(K142=\"\",\"\",K142/COUNTIF('Data Input'!$C$8:$AA$8,\"x\"))","v":""},{"$f":"IF(ISBLANK('Data Input'!A147),\"\",SUM('Data Input'!P147,'Data Input'!V147,'Data Input'!W147))","v":""},{"$f":"IF(M142=\"\",\"\",M142/COUNTIF('Data Input'!$C$8:$AA$8,\"÷\"))","v":""},{"$f":"IF(ISBLANK('Data Input'!A147),\"\",SUM('Data Input'!T147,'Data Input'!X147,'Data Input'!Z147,'Data Input'!AA147))","v":""},{"$f":"IF(O142=\"\",\"\",O142/COUNTIF('Data Input'!$C$8:$AA$8,\"F\"))","v":""}]
[{"$f":"IF('Data Input'!A148=0,\"\",'Data Input'!A148)","v":""},{"$f":"IF(ISBLANK('Data Input'!A148),\"\",COUNTIF('Data Input'!C148:AA148,\"\"))","v":""},{"$f":"IF(ISBLANK('Data Input'!A148),\"\",COUNTIF('Data Input'!C148:AA148,\"0\"))","v":""},{"$f":"IF(ISBLANK('Data Input'!A148),\"\",SUM(B143,C143))","v":""},{"$f":"IF(ISBLANK('Data Input'!A148),\"\",SUM('Data Input'!C148:AA148))","v":""},{"$f":"IF(E143=\"\",\"\",E143/(COUNTA('Data Input'!$C$8:$AA$8)))","v":""},{"$f":"IF(ISBLANK('Data Input'!A148),\"\",SUM('Data Input'!C148,'Data Input'!F148,'Data Input'!G148,'Data Input'!J148,'Data Input'!L148,'Data Input'!O148,'Data Input'!Q148,'Data Input'!R148,'Data Input'!U148))","v":""},{"$f":"IF(G143=\"\",\"\",G143/COUNTIF('Data Input'!$C$8:$AA$8,\"+\"))","v":""},{"$f":"IF(ISBLANK('Data Input'!A148),\"\",SUM('Data Input'!D148,'Data Input'!E148,'Data Input'!K148,'Data Input'!M148,'Data Input'!Y148))","v":""},{"$f":"IF(I143=\"\",\"\",I143/COUNTIF('Data Input'!$C$8:$AA$8,\"-\"))","v":""},{"$f":"IF(ISBLANK('Data Input'!A148),\"\",SUM('Data Input'!H148,'Data Input'!I148,'Data Input'!N148,'Data Input'!S148))","v":""},{"$f":"IF(K143=\"\",\"\",K143/COUNTIF('Data Input'!$C$8:$AA$8,\"x\"))","v":""},{"$f":"IF(ISBLANK('Data Input'!A148),\"\",SUM('Data Input'!P148,'Data Input'!V148,'Data Input'!W148))","v":""},{"$f":"IF(M143=\"\",\"\",M143/COUNTIF('Data Input'!$C$8:$AA$8,\"÷\"))","v":""},{"$f":"IF(ISBLANK('Data Input'!A148),\"\",SUM('Data Input'!T148,'Data Input'!X148,'Data Input'!Z148,'Data Input'!AA148))","v":""},{"$f":"IF(O143=\"\",\"\",O143/COUNTIF('Data Input'!$C$8:$AA$8,\"F\"))","v":""}]
[{"$f":"IF('Data Input'!A149=0,\"\",'Data Input'!A149)","v":""},{"$f":"IF(ISBLANK('Data Input'!A149),\"\",COUNTIF('Data Input'!C149:AA149,\"\"))","v":""},{"$f":"IF(ISBLANK('Data Input'!A149),\"\",COUNTIF('Data Input'!C149:AA149,\"0\"))","v":""},{"$f":"IF(ISBLANK('Data Input'!A149),\"\",SUM(B144,C144))","v":""},{"$f":"IF(ISBLANK('Data Input'!A149),\"\",SUM('Data Input'!C149:AA149))","v":""},{"$f":"IF(E144=\"\",\"\",E144/(COUNTA('Data Input'!$C$8:$AA$8)))","v":""},{"$f":"IF(ISBLANK('Data Input'!A149),\"\",SUM('Data Input'!C149,'Data Input'!F149,'Data Input'!G149,'Data Input'!J149,'Data Input'!L149,'Data Input'!O149,'Data Input'!Q149,'Data Input'!R149,'Data Input'!U149))","v":""},{"$f":"IF(G144=\"\",\"\",G144/COUNTIF('Data Input'!$C$8:$AA$8,\"+\"))","v":""},{"$f":"IF(ISBLANK('Data Input'!A149),\"\",SUM('Data Input'!D149,'Data Input'!E149,'Data Input'!K149,'Data Input'!M149,'Data Input'!Y149))","v":""},{"$f":"IF(I144=\"\",\"\",I144/COUNTIF('Data Input'!$C$8:$AA$8,\"-\"))","v":""},{"$f":"IF(ISBLANK('Data Input'!A149),\"\",SUM('Data Input'!H149,'Data Input'!I149,'Data Input'!N149,'Data Input'!S149))","v":""},{"$f":"IF(K144=\"\",\"\",K144/COUNTIF('Data Input'!$C$8:$AA$8,\"x\"))","v":""},{"$f":"IF(ISBLANK('Data Input'!A149),\"\",SUM('Data Input'!P149,'Data Input'!V149,'Data Input'!W149))","v":""},{"$f":"IF(M144=\"\",\"\",M144/COUNTIF('Data Input'!$C$8:$AA$8,\"÷\"))","v":""},{"$f":"IF(ISBLANK('Data Input'!A149),\"\",SUM('Data Input'!T149,'Data Input'!X149,'Data Input'!Z149,'Data Input'!AA149))","v":""},{"$f":"IF(O144=\"\",\"\",O144/COUNTIF('Data Input'!$C$8:$AA$8,\"F\"))","v":""}]
[{"$f":"IF('Data Input'!A150=0,\"\",'Data Input'!A150)","v":""},{"$f":"IF(ISBLANK('Data Input'!A150),\"\",COUNTIF('Data Input'!C150:AA150,\"\"))","v":""},{"$f":"IF(ISBLANK('Data Input'!A150),\"\",COUNTIF('Data Input'!C150:AA150,\"0\"))","v":""},{"$f":"IF(ISBLANK('Data Input'!A150),\"\",SUM(B145,C145))","v":""},{"$f":"IF(ISBLANK('Data Input'!A150),\"\",SUM('Data Input'!C150:AA150))","v":""},{"$f":"IF(E145=\"\",\"\",E145/(COUNTA('Data Input'!$C$8:$AA$8)))","v":""},{"$f":"IF(ISBLANK('Data Input'!A150),\"\",SUM('Data Input'!C150,'Data Input'!F150,'Data Input'!G150,'Data Input'!J150,'Data Input'!L150,'Data Input'!O150,'Data Input'!Q150,'Data Input'!R150,'Data Input'!U150))","v":""},{"$f":"IF(G145=\"\",\"\",G145/COUNTIF('Data Input'!$C$8:$AA$8,\"+\"))","v":""},{"$f":"IF(ISBLANK('Data Input'!A150),\"\",SUM('Data Input'!D150,'Data Input'!E150,'Data Input'!K150,'Data Input'!M150,'Data Input'!Y150))","v":""},{"$f":"IF(I145=\"\",\"\",I145/COUNTIF('Data Input'!$C$8:$AA$8,\"-\"))","v":""},{"$f":"IF(ISBLANK('Data Input'!A150),\"\",SUM('Data Input'!H150,'Data Input'!I150,'Data Input'!N150,'Data Input'!S150))","v":""},{"$f":"IF(K145=\"\",\"\",K145/COUNTIF('Data Input'!$C$8:$AA$8,\"x\"))","v":""},{"$f":"IF(ISBLANK('Data Input'!A150),\"\",SUM('Data Input'!P150,'Data Input'!V150,'Data Input'!W150))","v":""},{"$f":"IF(M145=\"\",\"\",M145/COUNTIF('Data Input'!$C$8:$AA$8,\"÷\"))","v":""},{"$f":"IF(ISBLANK('Data Input'!A150),\"\",SUM('Data Input'!T150,'Data Input'!X150,'Data Input'!Z150,'Data Input'!AA150))","v":""},{"$f":"IF(O145=\"\",\"\",O145/COUNTIF('Data Input'!$C$8:$AA$8,\"F\"))","v":""}]
[{"$f":"IF('Data Input'!A151=0,\"\",'Data Input'!A151)","v":""},{"$f":"IF(ISBLANK('Data Input'!A151),\"\",COUNTIF('Data Input'!C151:AA151,\"\"))","v":""},{"$f":"IF(ISBLANK('Data Input'!A151),\"\",COUNTIF('Data Input'!C151:AA151,\"0\"))","v":""},{"$f":"IF(ISBLANK('Data Input'!A151),\"\",SUM(B146,C146))","v":""},{"$f":"IF(ISBLANK('Data Input'!A151),\"\",SUM('Data Input'!C151:AA151))","v":""},{"$f":"IF(E146=\"\",\"\",E146/(COUNTA('Data Input'!$C$8:$AA$8)))","v":""},{"$f":"IF(ISBLANK('Data Input'!A151),\"\",SUM('Data Input'!C151,'Data Input'!F151,'Data Input'!G151,'Data Input'!J151,'Data Input'!L151,'Data Input'!O151,'Data Input'!Q151,'Data Input'!R151,'Data Input'!U151))","v":""},{"$f":"IF(G146=\"\",\"\",G146/COUNTIF('Data Input'!$C$8:$AA$8,\"+\"))","v":""},{"$f":"IF(ISBLANK('Data Input'!A151),\"\",SUM('Data Input'!D151,'Data Input'!E151,'Data Input'!K151,'Data Input'!M151,'Data Input'!Y151))","v":""},{"$f":"IF(I146=\"\",\"\",I146/COUNTIF('Data Input'!$C$8:$AA$8,\"-\"))","v":""},{"$f":"IF(ISBLANK('Data Input'!A151),\"\",SUM('Data Input'!H151,'Data Input'!I151,'Data Input'!N151,'Data Input'!S151))","v":""},{"$f":"IF(K146=\"\",\"\",K146/COUNTIF('Data Input'!$C$8:$AA$8,\"x\"))","v":""},{"$f":"IF(ISBLANK('Data Input'!A151),\"\",SUM('Data Input'!P151,'Data Input'!V151,'Data Input'!W151))","v":""},{"$f":"IF(M146=\"\",\"\",M146/COUNTIF('Data Input'!$C$8:$AA$8,\"÷\"))","v":""},{"$f":"IF(ISBLANK('Data Input'!A151),\"\",SUM('Data Input'!T151,'Data Input'!X151,'Data Input'!Z151,'Data Input'!AA151))","v":""},{"$f":"IF(O146=\"\",\"\",O146/COUNTIF('Data Input'!$C$8:$AA$8,\"F\"))","v":""}]
[{"$f":"IF('Data Input'!A152=0,\"\",'Data Input'!A152)","v":""},{"$f":"IF(ISBLANK('Data Input'!A152),\"\",COUNTIF('Data Input'!C152:AA152,\"\"))","v":""},{"$f":"IF(ISBLANK('Data Input'!A152),\"\",COUNTIF('Data Input'!C152:AA152,\"0\"))","v":""},{"$f":"IF(ISBLANK('Data Input'!A152),\"\",SUM(B147,C147))","v":""},{"$f":"IF(ISBLANK('Data Input'!A152),\"\",SUM('Data Input'!C152:AA152))","v":""},{"$f":"IF(E147=\"\",\"\",E147/(COUNTA('Data Input'!$C$8:$AA$8)))","v":""},{"$f":"IF(ISBLANK('Data Input'!A152),\"\",SUM('Data Input'!C152,'Data Input'!F152,'Data Input'!G152,'Data Input'!J152,'Data Input'!L152,'Data Input'!O152,'Data Input'!Q152,'Data Input'!R152,'Data Input'!U152))","v":""},{"$f":"IF(G147=\"\",\"\",G147/COUNTIF('Data Input'!$C$8:$AA$8,\"+\"))","v":""},{"$f":"IF(ISBLANK('Data Input'!A152),\"\",SUM('Data Input'!D152,'Data Input'!E152,'Data Input'!K152,'Data Input'!M152,'Data Input'!Y152))","v":""},{"$f":"IF(I147=\"\",\"\",I147/COUNTIF('Data Input'!$C$8:$AA$8,\"-\"))","v":""},{"$f":"IF(ISBLANK('Data Input'!A152),\"\",SUM('Data Input'!H152,'Data Input'!I152,'Data Input'!N152,'Data Input'!S152))","v":""},{"$f":"IF(K147=\"\",\"\",K147/COUNTIF('Data Input'!$C$8:$AA$8,\"x\"))","v":""},{"$f":"IF(ISBLANK('Data Input'!A152),\"\",SUM('Data Input'!P152,'Data Input'!V152,'Data Input'!W152))","v":""},{"$f":"IF(M147=\"\",\"\",M147/COUNTIF('Data Input'!$C$8:$AA$8,\"÷\"))","v":""},{"$f":"IF(ISBLANK('Data Input'!A152),\"\",SUM('Data Input'!T152,'Data Input'!X152,'Data Input'!Z152,'Data Input'!AA152))","v":""},{"$f":"IF(O147=\"\",\"\",O147/COUNTIF('Data Input'!$C$8:$AA$8,\"F\"))","v":""}]
[{"$f":"IF('Data Input'!A153=0,\"\",'Data Input'!A153)","v":""},{"$f":"IF(ISBLANK('Data Input'!A153),\"\",COUNTIF('Data Input'!C153:AA153,\"\"))","v":""},{"$f":"IF(ISBLANK('Data Input'!A153),\"\",COUNTIF('Data Input'!C153:AA153,\"0\"))","v":""},{"$f":"IF(ISBLANK('Data Input'!A153),\"\",SUM(B148,C148))","v":""},{"$f":"IF(ISBLANK('Data Input'!A153),\"\",SUM('Data Input'!C153:AA153))","v":""},{"$f":"IF(E148=\"\",\"\",E148/(COUNTA('Data Input'!$C$8:$AA$8)))","v":""},{"$f":"IF(ISBLANK('Data Input'!A153),\"\",SUM('Data Input'!C153,'Data Input'!F153,'Data Input'!G153,'Data Input'!J153,'Data Input'!L153,'Data Input'!O153,'Data Input'!Q153,'Data Input'!R153,'Data Input'!U153))","v":""},{"$f":"IF(G148=\"\",\"\",G148/COUNTIF('Data Input'!$C$8:$AA$8,\"+\"))","v":""},{"$f":"IF(ISBLANK('Data Input'!A153),\"\",SUM('Data Input'!D153,'Data Input'!E153,'Data Input'!K153,'Data Input'!M153,'Data Input'!Y153))","v":""},{"$f":"IF(I148=\"\",\"\",I148/COUNTIF('Data Input'!$C$8:$AA$8,\"-\"))","v":""},{"$f":"IF(ISBLANK('Data Input'!A153),\"\",SUM('Data Input'!H153,'Data Input'!I153,'Data Input'!N153,'Data Input'!S153))","v":""},{"$f":"IF(K148=\"\",\"\",K148/COUNTIF('Data Input'!$C$8:$AA$8,\"x\"))","v":""},{"$f":"IF(ISBLANK('Data Input'!A153),\"\",SUM('Data Input'!P153,'Data Input'!V153,'Data Input'!W153))","v":""},{"$f":"IF(M148=\"\",\"\",M148/COUNTIF('Data Input'!$C$8:$AA$8,\"÷\"))","v":""},{"$f":"IF(ISBLANK('Data Input'!A153),\"\",SUM('Data Input'!T153,'Data Input'!X153,'Data Input'!Z153,'Data Input'!AA153))","v":""},{"$f":"IF(O148=\"\",\"\",O148/COUNTIF('Data Input'!$C$8:$AA$8,\"F\"))","v":""}]
[{"$f":"IF('Data Input'!A154=0,\"\",'Data Input'!A154)","v":""},{"$f":"IF(ISBLANK('Data Input'!A154),\"\",COUNTIF('Data Input'!C154:AA154,\"\"))","v":""},{"$f":"IF(ISBLANK('Data Input'!A154),\"\",COUNTIF('Data Input'!C154:AA154,\"0\"))","v":""},{"$f":"IF(ISBLANK('Data Input'!A154),\"\",SUM(B149,C149))","v":""},{"$f":"IF(ISBLANK('Data Input'!A154),\"\",SUM('Data Input'!C154:AA154))","v":""},{"$f":"IF(E149=\"\",\"\",E149/(COUNTA('Data Input'!$C$8:$AA$8)))","v":""},{"$f":"IF(ISBLANK('Data Input'!A154),\"\",SUM('Data Input'!C154,'Data Input'!F154,'Data Input'!G154,'Data Input'!J154,'Data Input'!L154,'Data Input'!O154,'Data Input'!Q154,'Data Input'!R154,'Data Input'!U154))","v":""},{"$f":"IF(G149=\"\",\"\",G149/COUNTIF('Data Input'!$C$8:$AA$8,\"+\"))","v":""},{"$f":"IF(ISBLANK('Data Input'!A154),\"\",SUM('Data Input'!D154,'Data Input'!E154,'Data Input'!K154,'Data Input'!M154,'Data Input'!Y154))","v":""},{"$f":"IF(I149=\"\",\"\",I149/COUNTIF('Data Input'!$C$8:$AA$8,\"-\"))","v":""},{"$f":"IF(ISBLANK('Data Input'!A154),\"\",SUM('Data Input'!H154,'Data Input'!I154,'Data Input'!N154,'Data Input'!S154))","v":""},{"$f":"IF(K149=\"\",\"\",K149/COUNTIF('Data Input'!$C$8:$AA$8,\"x\"))","v":""},{"$f":"IF(ISBLANK('Data Input'!A154),\"\",SUM('Data Input'!P154,'Data Input'!V154,'Data Input'!W154))","v":""},{"$f":"IF(M149=\"\",\"\",M149/COUNTIF('Data Input'!$C$8:$AA$8,\"÷\"))","v":""},{"$f":"IF(ISBLANK('Data Input'!A154),\"\",SUM('Data Input'!T154,'Data Input'!X154,'Data Input'!Z154,'Data Input'!AA154))","v":""},{"$f":"IF(O149=\"\",\"\",O149/COUNTIF('Data Input'!$C$8:$AA$8,\"F\"))","v":""}]
[{"$f":"IF('Data Input'!A155=0,\"\",'Data Input'!A155)","v":""},{"$f":"IF(ISBLANK('Data Input'!A155),\"\",COUNTIF('Data Input'!C155:AA155,\"\"))","v":""},{"$f":"IF(ISBLANK('Data Input'!A155),\"\",COUNTIF('Data Input'!C155:AA155,\"0\"))","v":""},{"$f":"IF(ISBLANK('Data Input'!A155),\"\",SUM(B150,C150))","v":""},{"$f":"IF(ISBLANK('Data Input'!A155),\"\",SUM('Data Input'!C155:AA155))","v":""},{"$f":"IF(E150=\"\",\"\",E150/(COUNTA('Data Input'!$C$8:$AA$8)))","v":""},{"$f":"IF(ISBLANK('Data Input'!A155),\"\",SUM('Data Input'!C155,'Data Input'!F155,'Data Input'!G155,'Data Input'!J155,'Data Input'!L155,'Data Input'!O155,'Data Input'!Q155,'Data Input'!R155,'Data Input'!U155))","v":""},{"$f":"IF(G150=\"\",\"\",G150/COUNTIF('Data Input'!$C$8:$AA$8,\"+\"))","v":""},{"$f":"IF(ISBLANK('Data Input'!A155),\"\",SUM('Data Input'!D155,'Data Input'!E155,'Data Input'!K155,'Data Input'!M155,'Data Input'!Y155))","v":""},{"$f":"IF(I150=\"\",\"\",I150/COUNTIF('Data Input'!$C$8:$AA$8,\"-\"))","v":""},{"$f":"IF(ISBLANK('Data Input'!A155),\"\",SUM('Data Input'!H155,'Data Input'!I155,'Data Input'!N155,'Data Input'!S155))","v":""},{"$f":"IF(K150=\"\",\"\",K150/COUNTIF('Data Input'!$C$8:$AA$8,\"x\"))","v":""},{"$f":"IF(ISBLANK('Data Input'!A155),\"\",SUM('Data Input'!P155,'Data Input'!V155,'Data Input'!W155))","v":""},{"$f":"IF(M150=\"\",\"\",M150/COUNTIF('Data Input'!$C$8:$AA$8,\"÷\"))","v":""},{"$f":"IF(ISBLANK('Data Input'!A155),\"\",SUM('Data Input'!T155,'Data Input'!X155,'Data Input'!Z155,'Data Input'!AA155))","v":""},{"$f":"IF(O150=\"\",\"\",O150/COUNTIF('Data Input'!$C$8:$AA$8,\"F\"))","v":""}]
[{"$f":"IF('Data Input'!A156=0,\"\",'Data Input'!A156)","v":""},{"$f":"IF(ISBLANK('Data Input'!A156),\"\",COUNTIF('Data Input'!C156:AA156,\"\"))","v":""},{"$f":"IF(ISBLANK('Data Input'!A156),\"\",COUNTIF('Data Input'!C156:AA156,\"0\"))","v":""},{"$f":"IF(ISBLANK('Data Input'!A156),\"\",SUM(B151,C151))","v":""},{"$f":"IF(ISBLANK('Data Input'!A156),\"\",SUM('Data Input'!C156:AA156))","v":""},{"$f":"IF(E151=\"\",\"\",E151/(COUNTA('Data Input'!$C$8:$AA$8)))","v":""},{"$f":"IF(ISBLANK('Data Input'!A156),\"\",SUM('Data Input'!C156,'Data Input'!F156,'Data Input'!G156,'Data Input'!J156,'Data Input'!L156,'Data Input'!O156,'Data Input'!Q156,'Data Input'!R156,'Data Input'!U156))","v":""},{"$f":"IF(G151=\"\",\"\",G151/COUNTIF('Data Input'!$C$8:$AA$8,\"+\"))","v":""},{"$f":"IF(ISBLANK('Data Input'!A156),\"\",SUM('Data Input'!D156,'Data Input'!E156,'Data Input'!K156,'Data Input'!M156,'Data Input'!Y156))","v":""},{"$f":"IF(I151=\"\",\"\",I151/COUNTIF('Data Input'!$C$8:$AA$8,\"-\"))","v":""},{"$f":"IF(ISBLANK('Data Input'!A156),\"\",SUM('Data Input'!H156,'Data Input'!I156,'Data Input'!N156,'Data Input'!S156))","v":""},{"$f":"IF(K151=\"\",\"\",K151/COUNTIF('Data Input'!$C$8:$AA$8,\"x\"))","v":""},{"$f":"IF(ISBLANK('Data Input'!A156),\"\",SUM('Data Input'!P156,'Data Input'!V156,'Data Input'!W156))","v":""},{"$f":"IF(M151=\"\",\"\",M151/COUNTIF('Data Input'!$C$8:$AA$8,\"÷\"))","v":""},{"$f":"IF(ISBLANK('Data Input'!A156),\"\",SUM('Data Input'!T156,'Data Input'!X156,'Data Input'!Z156,'Data Input'!AA156))","v":""},{"$f":"IF(O151=\"\",\"\",O151/COUNTIF('Data Input'!$C$8:$AA$8,\"F\"))","v":""}]
[{"$f":"IF('Data Input'!A157=0,\"\",'Data Input'!A157)","v":""},{"$f":"IF(ISBLANK('Data Input'!A157),\"\",COUNTIF('Data Input'!C157:AA157,\"\"))","v":""},{"$f":"IF(ISBLANK('Data Input'!A157),\"\",COUNTIF('Data Input'!C157:AA157,\"0\"))","v":""},{"$f":"IF(ISBLANK('Data Input'!A157),\"\",SUM(B152,C152))","v":""},{"$f":"IF(ISBLANK('Data Input'!A157),\"\",SUM('Data Input'!C157:AA157))","v":""},{"$f":"IF(E152=\"\",\"\",E152/(COUNTA('Data Input'!$C$8:$AA$8)))","v":""},{"$f":"IF(ISBLANK('Data Input'!A157),\"\",SUM('Data Input'!C157,'Data Input'!F157,'Data Input'!G157,'Data Input'!J157,'Data Input'!L157,'Data Input'!O157,'Data Input'!Q157,'Data Input'!R157,'Data Input'!U157))","v":""},{"$f":"IF(G152=\"\",\"\",G152/COUNTIF('Data Input'!$C$8:$AA$8,\"+\"))","v":""},{"$f":"IF(ISBLANK('Data Input'!A157),\"\",SUM('Data Input'!D157,'Data Input'!E157,'Data Input'!K157,'Data Input'!M157,'Data Input'!Y157))","v":""},{"$f":"IF(I152=\"\",\"\",I152/COUNTIF('Data Input'!$C$8:$AA$8,\"-\"))","v":""},{"$f":"IF(ISBLANK('Data Input'!A157),\"\",SUM('Data Input'!H157,'Data Input'!I157,'Data Input'!N157,'Data Input'!S157))","v":""},{"$f":"IF(K152=\"\",\"\",K152/COUNTIF('Data Input'!$C$8:$AA$8,\"x\"))","v":""},{"$f":"IF(ISBLANK('Data Input'!A157),\"\",SUM('Data Input'!P157,'Data Input'!V157,'Data Input'!W157))","v":""},{"$f":"IF(M152=\"\",\"\",M152/COUNTIF('Data Input'!$C$8:$AA$8,\"÷\"))","v":""},{"$f":"IF(ISBLANK('Data Input'!A157),\"\",SUM('Data Input'!T157,'Data Input'!X157,'Data Input'!Z157,'Data Input'!AA157))","v":""},{"$f":"IF(O152=\"\",\"\",O152/COUNTIF('Data Input'!$C$8:$AA$8,\"F\"))","v":""}]
[{"$f":"IF('Data Input'!A158=0,\"\",'Data Input'!A158)","v":""},{"$f":"IF(ISBLANK('Data Input'!A158),\"\",COUNTIF('Data Input'!C158:AA158,\"\"))","v":""},{"$f":"IF(ISBLANK('Data Input'!A158),\"\",COUNTIF('Data Input'!C158:AA158,\"0\"))","v":""},{"$f":"IF(ISBLANK('Data Input'!A158),\"\",SUM(B153,C153))","v":""},{"$f":"IF(ISBLANK('Data Input'!A158),\"\",SUM('Data Input'!C158:AA158))","v":""},{"$f":"IF(E153=\"\",\"\",E153/(COUNTA('Data Input'!$C$8:$AA$8)))","v":""},{"$f":"IF(ISBLANK('Data Input'!A158),\"\",SUM('Data Input'!C158,'Data Input'!F158,'Data Input'!G158,'Data Input'!J158,'Data Input'!L158,'Data Input'!O158,'Data Input'!Q158,'Data Input'!R158,'Data Input'!U158))","v":""},{"$f":"IF(G153=\"\",\"\",G153/COUNTIF('Data Input'!$C$8:$AA$8,\"+\"))","v":""},{"$f":"IF(ISBLANK('Data Input'!A158),\"\",SUM('Data Input'!D158,'Data Input'!E158,'Data Input'!K158,'Data Input'!M158,'Data Input'!Y158))","v":""},{"$f":"IF(I153=\"\",\"\",I153/COUNTIF('Data Input'!$C$8:$AA$8,\"-\"))","v":""},{"$f":"IF(ISBLANK('Data Input'!A158),\"\",SUM('Data Input'!H158,'Data Input'!I158,'Data Input'!N158,'Data Input'!S158))","v":""},{"$f":"IF(K153=\"\",\"\",K153/COUNTIF('Data Input'!$C$8:$AA$8,\"x\"))","v":""},{"$f":"IF(ISBLANK('Data Input'!A158),\"\",SUM('Data Input'!P158,'Data Input'!V158,'Data Input'!W158))","v":""},{"$f":"IF(M153=\"\",\"\",M153/COUNTIF('Data Input'!$C$8:$AA$8,\"÷\"))","v":""},{"$f":"IF(ISBLANK('Data Input'!A158),\"\",SUM('Data Input'!T158,'Data Input'!X158,'Data Input'!Z158,'Data Input'!AA158))","v":""},{"$f":"IF(O153=\"\",\"\",O153/COUNTIF('Data Input'!$C$8:$AA$8,\"F\"))","v":""}]
[{"$f":"IF('Data Input'!A159=0,\"\",'Data Input'!A159)","v":""},{"$f":"IF(ISBLANK('Data Input'!A159),\"\",COUNTIF('Data Input'!C159:AA159,\"\"))","v":""},{"$f":"IF(ISBLANK('Data Input'!A159),\"\",COUNTIF('Data Input'!C159:AA159,\"0\"))","v":""},{"$f":"IF(ISBLANK('Data Input'!A159),\"\",SUM(B154,C154))","v":""},{"$f":"IF(ISBLANK('Data Input'!A159),\"\",SUM('Data Input'!C159:AA159))","v":""},{"$f":"IF(E154=\"\",\"\",E154/(COUNTA('Data Input'!$C$8:$AA$8)))","v":""},{"$f":"IF(ISBLANK('Data Input'!A159),\"\",SUM('Data Input'!C159,'Data Input'!F159,'Data Input'!G159,'Data Input'!J159,'Data Input'!L159,'Data Input'!O159,'Data Input'!Q159,'Data Input'!R159,'Data Input'!U159))","v":""},{"$f":"IF(G154=\"\",\"\",G154/COUNTIF('Data Input'!$C$8:$AA$8,\"+\"))","v":""},{"$f":"IF(ISBLANK('Data Input'!A159),\"\",SUM('Data Input'!D159,'Data Input'!E159,'Data Input'!K159,'Data Input'!M159,'Data Input'!Y159))","v":""},{"$f":"IF(I154=\"\",\"\",I154/COUNTIF('Data Input'!$C$8:$AA$8,\"-\"))","v":""},{"$f":"IF(ISBLANK('Data Input'!A159),\"\",SUM('Data Input'!H159,'Data Input'!I159,'Data Input'!N159,'Data Input'!S159))","v":""},{"$f":"IF(K154=\"\",\"\",K154/COUNTIF('Data Input'!$C$8:$AA$8,\"x\"))","v":""},{"$f":"IF(ISBLANK('Data Input'!A159),\"\",SUM('Data Input'!P159,'Data Input'!V159,'Data Input'!W159))","v":""},{"$f":"IF(M154=\"\",\"\",M154/COUNTIF('Data Input'!$C$8:$AA$8,\"÷\"))","v":""},{"$f":"IF(ISBLANK('Data Input'!A159),\"\",SUM('Data Input'!T159,'Data Input'!X159,'Data Input'!Z159,'Data Input'!AA159))","v":""},{"$f":"IF(O154=\"\",\"\",O154/COUNTIF('Data Input'!$C$8:$AA$8,\"F\"))","v":""}]
[{"$f":"IF('Data Input'!A160=0,\"\",'Data Input'!A160)","v":""},{"$f":"IF(ISBLANK('Data Input'!A160),\"\",COUNTIF('Data Input'!C160:AA160,\"\"))","v":""},{"$f":"IF(ISBLANK('Data Input'!A160),\"\",COUNTIF('Data Input'!C160:AA160,\"0\"))","v":""},{"$f":"IF(ISBLANK('Data Input'!A160),\"\",SUM(B155,C155))","v":""},{"$f":"IF(ISBLANK('Data Input'!A160),\"\",SUM('Data Input'!C160:AA160))","v":""},{"$f":"IF(E155=\"\",\"\",E155/(COUNTA('Data Input'!$C$8:$AA$8)))","v":""},{"$f":"IF(ISBLANK('Data Input'!A160),\"\",SUM('Data Input'!C160,'Data Input'!F160,'Data Input'!G160,'Data Input'!J160,'Data Input'!L160,'Data Input'!O160,'Data Input'!Q160,'Data Input'!R160,'Data Input'!U160))","v":""},{"$f":"IF(G155=\"\",\"\",G155/COUNTIF('Data Input'!$C$8:$AA$8,\"+\"))","v":""},{"$f":"IF(ISBLANK('Data Input'!A160),\"\",SUM('Data Input'!D160,'Data Input'!E160,'Data Input'!K160,'Data Input'!M160,'Data Input'!Y160))","v":""},{"$f":"IF(I155=\"\",\"\",I155/COUNTIF('Data Input'!$C$8:$AA$8,\"-\"))","v":""},{"$f":"IF(ISBLANK('Data Input'!A160),\"\",SUM('Data Input'!H160,'Data Input'!I160,'Data Input'!N160,'Data Input'!S160))","v":""},{"$f":"IF(K155=\"\",\"\",K155/COUNTIF('Data Input'!$C$8:$AA$8,\"x\"))","v":""},{"$f":"IF(ISBLANK('Data Input'!A160),\"\",SUM('Data Input'!P160,'Data Input'!V160,'Data Input'!W160))","v":""},{"$f":"IF(M155=\"\",\"\",M155/COUNTIF('Data Input'!$C$8:$AA$8,\"÷\"))","v":""},{"$f":"IF(ISBLANK('Data Input'!A160),\"\",SUM('Data Input'!T160,'Data Input'!X160,'Data Input'!Z160,'Data Input'!AA160))","v":""},{"$f":"IF(O155=\"\",\"\",O155/COUNTIF('Data Input'!$C$8:$AA$8,\"F\"))","v":""}]
[{"$f":"IF('Data Input'!A161=0,\"\",'Data Input'!A161)","v":""},{"$f":"IF(ISBLANK('Data Input'!A161),\"\",COUNTIF('Data Input'!C161:AA161,\"\"))","v":""},{"$f":"IF(ISBLANK('Data Input'!A161),\"\",COUNTIF('Data Input'!C161:AA161,\"0\"))","v":""},{"$f":"IF(ISBLANK('Data Input'!A161),\"\",SUM(B156,C156))","v":""},{"$f":"IF(ISBLANK('Data Input'!A161),\"\",SUM('Data Input'!C161:AA161))","v":""},{"$f":"IF(E156=\"\",\"\",E156/(COUNTA('Data Input'!$C$8:$AA$8)))","v":""},{"$f":"IF(ISBLANK('Data Input'!A161),\"\",SUM('Data Input'!C161,'Data Input'!F161,'Data Input'!G161,'Data Input'!J161,'Data Input'!L161,'Data Input'!O161,'Data Input'!Q161,'Data Input'!R161,'Data Input'!U161))","v":""},{"$f":"IF(G156=\"\",\"\",G156/COUNTIF('Data Input'!$C$8:$AA$8,\"+\"))","v":""},{"$f":"IF(ISBLANK('Data Input'!A161),\"\",SUM('Data Input'!D161,'Data Input'!E161,'Data Input'!K161,'Data Input'!M161,'Data Input'!Y161))","v":""},{"$f":"IF(I156=\"\",\"\",I156/COUNTIF('Data Input'!$C$8:$AA$8,\"-\"))","v":""},{"$f":"IF(ISBLANK('Data Input'!A161),\"\",SUM('Data Input'!H161,'Data Input'!I161,'Data Input'!N161,'Data Input'!S161))","v":""},{"$f":"IF(K156=\"\",\"\",K156/COUNTIF('Data Input'!$C$8:$AA$8,\"x\"))","v":""},{"$f":"IF(ISBLANK('Data Input'!A161),\"\",SUM('Data Input'!P161,'Data Input'!V161,'Data Input'!W161))","v":""},{"$f":"IF(M156=\"\",\"\",M156/COUNTIF('Data Input'!$C$8:$AA$8,\"÷\"))","v":""},{"$f":"IF(ISBLANK('Data Input'!A161),\"\",SUM('Data Input'!T161,'Data Input'!X161,'Data Input'!Z161,'Data Input'!AA161))","v":""},{"$f":"IF(O156=\"\",\"\",O156/COUNTIF('Data Input'!$C$8:$AA$8,\"F\"))","v":""}]
[{"$f":"IF('Data Input'!A162=0,\"\",'Data Input'!A162)","v":""},{"$f":"IF(ISBLANK('Data Input'!A162),\"\",COUNTIF('Data Input'!C162:AA162,\"\"))","v":""},{"$f":"IF(ISBLANK('Data Input'!A162),\"\",COUNTIF('Data Input'!C162:AA162,\"0\"))","v":""},{"$f":"IF(ISBLANK('Data Input'!A162),\"\",SUM(B157,C157))","v":""},{"$f":"IF(ISBLANK('Data Input'!A162),\"\",SUM('Data Input'!C162:AA162))","v":""},{"$f":"IF(E157=\"\",\"\",E157/(COUNTA('Data Input'!$C$8:$AA$8)))","v":""},{"$f":"IF(ISBLANK('Data Input'!A162),\"\",SUM('Data Input'!C162,'Data Input'!F162,'Data Input'!G162,'Data Input'!J162,'Data Input'!L162,'Data Input'!O162,'Data Input'!Q162,'Data Input'!R162,'Data Input'!U162))","v":""},{"$f":"IF(G157=\"\",\"\",G157/COUNTIF('Data Input'!$C$8:$AA$8,\"+\"))","v":""},{"$f":"IF(ISBLANK('Data Input'!A162),\"\",SUM('Data Input'!D162,'Data Input'!E162,'Data Input'!K162,'Data Input'!M162,'Data Input'!Y162))","v":""},{"$f":"IF(I157=\"\",\"\",I157/COUNTIF('Data Input'!$C$8:$AA$8,\"-\"))","v":""},{"$f":"IF(ISBLANK('Data Input'!A162),\"\",SUM('Data Input'!H162,'Data Input'!I162,'Data Input'!N162,'Data Input'!S162))","v":""},{"$f":"IF(K157=\"\",\"\",K157/COUNTIF('Data Input'!$C$8:$AA$8,\"x\"))","v":""},{"$f":"IF(ISBLANK('Data Input'!A162),\"\",SUM('Data Input'!P162,'Data Input'!V162,'Data Input'!W162))","v":""},{"$f":"IF(M157=\"\",\"\",M157/COUNTIF('Data Input'!$C$8:$AA$8,\"÷\"))","v":""},{"$f":"IF(ISBLANK('Data Input'!A162),\"\",SUM('Data Input'!T162,'Data Input'!X162,'Data Input'!Z162,'Data Input'!AA162))","v":""},{"$f":"IF(O157=\"\",\"\",O157/COUNTIF('Data Input'!$C$8:$AA$8,\"F\"))","v":""}]
[{"$f":"IF('Data Input'!A163=0,\"\",'Data Input'!A163)","v":""},{"$f":"IF(ISBLANK('Data Input'!A163),\"\",COUNTIF('Data Input'!C163:AA163,\"\"))","v":""},{"$f":"IF(ISBLANK('Data Input'!A163),\"\",COUNTIF('Data Input'!C163:AA163,\"0\"))","v":""},{"$f":"IF(ISBLANK('Data Input'!A163),\"\",SUM(B158,C158))","v":""},{"$f":"IF(ISBLANK('Data Input'!A163),\"\",SUM('Data Input'!C163:AA163))","v":""},{"$f":"IF(E158=\"\",\"\",E158/(COUNTA('Data Input'!$C$8:$AA$8)))","v":""},{"$f":"IF(ISBLANK('Data Input'!A163),\"\",SUM('Data Input'!C163,'Data Input'!F163,'Data Input'!G163,'Data Input'!J163,'Data Input'!L163,'Data Input'!O163,'Data Input'!Q163,'Data Input'!R163,'Data Input'!U163))","v":""},{"$f":"IF(G158=\"\",\"\",G158/COUNTIF('Data Input'!$C$8:$AA$8,\"+\"))","v":""},{"$f":"IF(ISBLANK('Data Input'!A163),\"\",SUM('Data Input'!D163,'Data Input'!E163,'Data Input'!K163,'Data Input'!M163,'Data Input'!Y163))","v":""},{"$f":"IF(I158=\"\",\"\",I158/COUNTIF('Data Input'!$C$8:$AA$8,\"-\"))","v":""},{"$f":"IF(ISBLANK('Data Input'!A163),\"\",SUM('Data Input'!H163,'Data Input'!I163,'Data Input'!N163,'Data Input'!S163))","v":""},{"$f":"IF(K158=\"\",\"\",K158/COUNTIF('Data Input'!$C$8:$AA$8,\"x\"))","v":""},{"$f":"IF(ISBLANK('Data Input'!A163),\"\",SUM('Data Input'!P163,'Data Input'!V163,'Data Input'!W163))","v":""},{"$f":"IF(M158=\"\",\"\",M158/COUNTIF('Data Input'!$C$8:$AA$8,\"÷\"))","v":""},{"$f":"IF(ISBLANK('Data Input'!A163),\"\",SUM('Data Input'!T163,'Data Input'!X163,'Data Input'!Z163,'Data Input'!AA163))","v":""},{"$f":"IF(O158=\"\",\"\",O158/COUNTIF('Data Input'!$C$8:$AA$8,\"F\"))","v":""}]
[{"$f":"IF('Data Input'!A164=0,\"\",'Data Input'!A164)","v":""},{"$f":"IF(ISBLANK('Data Input'!A164),\"\",COUNTIF('Data Input'!C164:AA164,\"\"))","v":""},{"$f":"IF(ISBLANK('Data Input'!A164),\"\",COUNTIF('Data Input'!C164:AA164,\"0\"))","v":""},{"$f":"IF(ISBLANK('Data Input'!A164),\"\",SUM(B159,C159))","v":""},{"$f":"IF(ISBLANK('Data Input'!A164),\"\",SUM('Data Input'!C164:AA164))","v":""},{"$f":"IF(E159=\"\",\"\",E159/(COUNTA('Data Input'!$C$8:$AA$8)))","v":""},{"$f":"IF(ISBLANK('Data Input'!A164),\"\",SUM('Data Input'!C164,'Data Input'!F164,'Data Input'!G164,'Data Input'!J164,'Data Input'!L164,'Data Input'!O164,'Data Input'!Q164,'Data Input'!R164,'Data Input'!U164))","v":""},{"$f":"IF(G159=\"\",\"\",G159/COUNTIF('Data Input'!$C$8:$AA$8,\"+\"))","v":""},{"$f":"IF(ISBLANK('Data Input'!A164),\"\",SUM('Data Input'!D164,'Data Input'!E164,'Data Input'!K164,'Data Input'!M164,'Data Input'!Y164))","v":""},{"$f":"IF(I159=\"\",\"\",I159/COUNTIF('Data Input'!$C$8:$AA$8,\"-\"))","v":""},{"$f":"IF(ISBLANK('Data Input'!A164),\"\",SUM('Data Input'!H164,'Data Input'!I164,'Data Input'!N164,'Data Input'!S164))","v":""},{"$f":"IF(K159=\"\",\"\",K159/COUNTIF('Data Input'!$C$8:$AA$8,\"x\"))","v":""},{"$f":"IF(ISBLANK('Data Input'!A164),\"\",SUM('Data Input'!P164,'Data Input'!V164,'Data Input'!W164))","v":""},{"$f":"IF(M159=\"\",\"\",M159/COUNTIF('Data Input'!$C$8:$AA$8,\"÷\"))","v":""},{"$f":"IF(ISBLANK('Data Input'!A164),\"\",SUM('Data Input'!T164,'Data Input'!X164,'Data Input'!Z164,'Data Input'!AA164))","v":""},{"$f":"IF(O159=\"\",\"\",O159/COUNTIF('Data Input'!$C$8:$AA$8,\"F\"))","v":""}]
[{"$f":"IF('Data Input'!A165=0,\"\",'Data Input'!A165)","v":""},{"$f":"IF(ISBLANK('Data Input'!A165),\"\",COUNTIF('Data Input'!C165:AA165,\"\"))","v":""},{"$f":"IF(ISBLANK('Data Input'!A165),\"\",COUNTIF('Data Input'!C165:AA165,\"0\"))","v":""},{"$f":"IF(ISBLANK('Data Input'!A165),\"\",SUM(B160,C160))","v":""},{"$f":"IF(ISBLANK('Data Input'!A165),\"\",SUM('Data Input'!C165:AA165))","v":""},{"$f":"IF(E160=\"\",\"\",E160/(COUNTA('Data Input'!$C$8:$AA$8)))","v":""},{"$f":"IF(ISBLANK('Data Input'!A165),\"\",SUM('Data Input'!C165,'Data Input'!F165,'Data Input'!G165,'Data Input'!J165,'Data Input'!L165,'Data Input'!O165,'Data Input'!Q165,'Data Input'!R165,'Data Input'!U165))","v":""},{"$f":"IF(G160=\"\",\"\",G160/COUNTIF('Data Input'!$C$8:$AA$8,\"+\"))","v":""},{"$f":"IF(ISBLANK('Data Input'!A165),\"\",SUM('Data Input'!D165,'Data Input'!E165,'Data Input'!K165,'Data Input'!M165,'Data Input'!Y165))","v":""},{"$f":"IF(I160=\"\",\"\",I160/COUNTIF('Data Input'!$C$8:$AA$8,\"-\"))","v":""},{"$f":"IF(ISBLANK('Data Input'!A165),\"\",SUM('Data Input'!H165,'Data Input'!I165,'Data Input'!N165,'Data Input'!S165))","v":""},{"$f":"IF(K160=\"\",\"\",K160/COUNTIF('Data Input'!$C$8:$AA$8,\"x\"))","v":""},{"$f":"IF(ISBLANK('Data Input'!A165),\"\",SUM('Data Input'!P165,'Data Input'!V165,'Data Input'!W165))","v":""},{"$f":"IF(M160=\"\",\"\",M160/COUNTIF('Data Input'!$C$8:$AA$8,\"÷\"))","v":""},{"$f":"IF(ISBLANK('Data Input'!A165),\"\",SUM('Data Input'!T165,'Data Input'!X165,'Data Input'!Z165,'Data Input'!AA165))","v":""},{"$f":"IF(O160=\"\",\"\",O160/COUNTIF('Data Input'!$C$8:$AA$8,\"F\"))","v":""}]
[{"$f":"IF('Data Input'!A166=0,\"\",'Data Input'!A166)","v":""},{"$f":"IF(ISBLANK('Data Input'!A166),\"\",COUNTIF('Data Input'!C166:AA166,\"\"))","v":""},{"$f":"IF(ISBLANK('Data Input'!A166),\"\",COUNTIF('Data Input'!C166:AA166,\"0\"))","v":""},{"$f":"IF(ISBLANK('Data Input'!A166),\"\",SUM(B161,C161))","v":""},{"$f":"IF(ISBLANK('Data Input'!A166),\"\",SUM('Data Input'!C166:AA166))","v":""},{"$f":"IF(E161=\"\",\"\",E161/(COUNTA('Data Input'!$C$8:$AA$8)))","v":""},{"$f":"IF(ISBLANK('Data Input'!A166),\"\",SUM('Data Input'!C166,'Data Input'!F166,'Data Input'!G166,'Data Input'!J166,'Data Input'!L166,'Data Input'!O166,'Data Input'!Q166,'Data Input'!R166,'Data Input'!U166))","v":""},{"$f":"IF(G161=\"\",\"\",G161/COUNTIF('Data Input'!$C$8:$AA$8,\"+\"))","v":""},{"$f":"IF(ISBLANK('Data Input'!A166),\"\",SUM('Data Input'!D166,'Data Input'!E166,'Data Input'!K166,'Data Input'!M166,'Data Input'!Y166))","v":""},{"$f":"IF(I161=\"\",\"\",I161/COUNTIF('Data Input'!$C$8:$AA$8,\"-\"))","v":""},{"$f":"IF(ISBLANK('Data Input'!A166),\"\",SUM('Data Input'!H166,'Data Input'!I166,'Data Input'!N166,'Data Input'!S166))","v":""},{"$f":"IF(K161=\"\",\"\",K161/COUNTIF('Data Input'!$C$8:$AA$8,\"x\"))","v":""},{"$f":"IF(ISBLANK('Data Input'!A166),\"\",SUM('Data Input'!P166,'Data Input'!V166,'Data Input'!W166))","v":""},{"$f":"IF(M161=\"\",\"\",M161/COUNTIF('Data Input'!$C$8:$AA$8,\"÷\"))","v":""},{"$f":"IF(ISBLANK('Data Input'!A166),\"\",SUM('Data Input'!T166,'Data Input'!X166,'Data Input'!Z166,'Data Input'!AA166))","v":""},{"$f":"IF(O161=\"\",\"\",O161/COUNTIF('Data Input'!$C$8:$AA$8,\"F\"))","v":""}]
[{"$f":"IF('Data Input'!A167=0,\"\",'Data Input'!A167)","v":""},{"$f":"IF(ISBLANK('Data Input'!A167),\"\",COUNTIF('Data Input'!C167:AA167,\"\"))","v":""},{"$f":"IF(ISBLANK('Data Input'!A167),\"\",COUNTIF('Data Input'!C167:AA167,\"0\"))","v":""},{"$f":"IF(ISBLANK('Data Input'!A167),\"\",SUM(B162,C162))","v":""},{"$f":"IF(ISBLANK('Data Input'!A167),\"\",SUM('Data Input'!C167:AA167))","v":""},{"$f":"IF(E162=\"\",\"\",E162/(COUNTA('Data Input'!$C$8:$AA$8)))","v":""},{"$f":"IF(ISBLANK('Data Input'!A167),\"\",SUM('Data Input'!C167,'Data Input'!F167,'Data Input'!G167,'Data Input'!J167,'Data Input'!L167,'Data Input'!O167,'Data Input'!Q167,'Data Input'!R167,'Data Input'!U167))","v":""},{"$f":"IF(G162=\"\",\"\",G162/COUNTIF('Data Input'!$C$8:$AA$8,\"+\"))","v":""},{"$f":"IF(ISBLANK('Data Input'!A167),\"\",SUM('Data Input'!D167,'Data Input'!E167,'Data Input'!K167,'Data Input'!M167,'Data Input'!Y167))","v":""},{"$f":"IF(I162=\"\",\"\",I162/COUNTIF('Data Input'!$C$8:$AA$8,\"-\"))","v":""},{"$f":"IF(ISBLANK('Data Input'!A167),\"\",SUM('Data Input'!H167,'Data Input'!I167,'Data Input'!N167,'Data Input'!S167))","v":""},{"$f":"IF(K162=\"\",\"\",K162/COUNTIF('Data Input'!$C$8:$AA$8,\"x\"))","v":""},{"$f":"IF(ISBLANK('Data Input'!A167),\"\",SUM('Data Input'!P167,'Data Input'!V167,'Data Input'!W167))","v":""},{"$f":"IF(M162=\"\",\"\",M162/COUNTIF('Data Input'!$C$8:$AA$8,\"÷\"))","v":""},{"$f":"IF(ISBLANK('Data Input'!A167),\"\",SUM('Data Input'!T167,'Data Input'!X167,'Data Input'!Z167,'Data Input'!AA167))","v":""},{"$f":"IF(O162=\"\",\"\",O162/COUNTIF('Data Input'!$C$8:$AA$8,\"F\"))","v":""}]
[{"$f":"IF('Data Input'!A168=0,\"\",'Data Input'!A168)","v":""},{"$f":"IF(ISBLANK('Data Input'!A168),\"\",COUNTIF('Data Input'!C168:AA168,\"\"))","v":""},{"$f":"IF(ISBLANK('Data Input'!A168),\"\",COUNTIF('Data Input'!C168:AA168,\"0\"))","v":""},{"$f":"IF(ISBLANK('Data Input'!A168),\"\",SUM(B163,C163))","v":""},{"$f":"IF(ISBLANK('Data Input'!A168),\"\",SUM('Data Input'!C168:AA168))","v":""},{"$f":"IF(E163=\"\",\"\",E163/(COUNTA('Data Input'!$C$8:$AA$8)))","v":""},{"$f":"IF(ISBLANK('Data Input'!A168),\"\",SUM('Data Input'!C168,'Data Input'!F168,'Data Input'!G168,'Data Input'!J168,'Data Input'!L168,'Data Input'!O168,'Data Input'!Q168,'Data Input'!R168,'Data Input'!U168))","v":""},{"$f":"IF(G163=\"\",\"\",G163/COUNTIF('Data Input'!$C$8:$AA$8,\"+\"))","v":""},{"$f":"IF(ISBLANK('Data Input'!A168),\"\",SUM('Data Input'!D168,'Data Input'!E168,'Data Input'!K168,'Data Input'!M168,'Data Input'!Y168))","v":""},{"$f":"IF(I163=\"\",\"\",I163/COUNTIF('Data Input'!$C$8:$AA$8,\"-\"))","v":""},{"$f":"IF(ISBLANK('Data Input'!A168),\"\",SUM('Data Input'!H168,'Data Input'!I168,'Data Input'!N168,'Data Input'!S168))","v":""},{"$f":"IF(K163=\"\",\"\",K163/COUNTIF('Data Input'!$C$8:$AA$8,\"x\"))","v":""},{"$f":"IF(ISBLANK('Data Input'!A168),\"\",SUM('Data Input'!P168,'Data Input'!V168,'Data Input'!W168))","v":""},{"$f":"IF(M163=\"\",\"\",M163/COUNTIF('Data Input'!$C$8:$AA$8,\"÷\"))","v":""},{"$f":"IF(ISBLANK('Data Input'!A168),\"\",SUM('Data Input'!T168,'Data Input'!X168,'Data Input'!Z168,'Data Input'!AA168))","v":""},{"$f":"IF(O163=\"\",\"\",O163/COUNTIF('Data Input'!$C$8:$AA$8,\"F\"))","v":""}]
[{"$f":"IF('Data Input'!A169=0,\"\",'Data Input'!A169)","v":""},{"$f":"IF(ISBLANK('Data Input'!A169),\"\",COUNTIF('Data Input'!C169:AA169,\"\"))","v":""},{"$f":"IF(ISBLANK('Data Input'!A169),\"\",COUNTIF('Data Input'!C169:AA169,\"0\"))","v":""},{"$f":"IF(ISBLANK('Data Input'!A169),\"\",SUM(B164,C164))","v":""},{"$f":"IF(ISBLANK('Data Input'!A169),\"\",SUM('Data Input'!C169:AA169))","v":""},{"$f":"IF(E164=\"\",\"\",E164/(COUNTA('Data Input'!$C$8:$AA$8)))","v":""},{"$f":"IF(ISBLANK('Data Input'!A169),\"\",SUM('Data Input'!C169,'Data Input'!F169,'Data Input'!G169,'Data Input'!J169,'Data Input'!L169,'Data Input'!O169,'Data Input'!Q169,'Data Input'!R169,'Data Input'!U169))","v":""},{"$f":"IF(G164=\"\",\"\",G164/COUNTIF('Data Input'!$C$8:$AA$8,\"+\"))","v":""},{"$f":"IF(ISBLANK('Data Input'!A169),\"\",SUM('Data Input'!D169,'Data Input'!E169,'Data Input'!K169,'Data Input'!M169,'Data Input'!Y169))","v":""},{"$f":"IF(I164=\"\",\"\",I164/COUNTIF('Data Input'!$C$8:$AA$8,\"-\"))","v":""},{"$f":"IF(ISBLANK('Data Input'!A169),\"\",SUM('Data Input'!H169,'Data Input'!I169,'Data Input'!N169,'Data Input'!S169))","v":""},{"$f":"IF(K164=\"\",\"\",K164/COUNTIF('Data Input'!$C$8:$AA$8,\"x\"))","v":""},{"$f":"IF(ISBLANK('Data Input'!A169),\"\",SUM('Data Input'!P169,'Data Input'!V169,'Data Input'!W169))","v":""},{"$f":"IF(M164=\"\",\"\",M164/COUNTIF('Data Input'!$C$8:$AA$8,\"÷\"))","v":""},{"$f":"IF(ISBLANK('Data Input'!A169),\"\",SUM('Data Input'!T169,'Data Input'!X169,'Data Input'!Z169,'Data Input'!AA169))","v":""},{"$f":"IF(O164=\"\",\"\",O164/COUNTIF('Data Input'!$C$8:$AA$8,\"F\"))","v":""}]
[{"$f":"IF('Data Input'!A170=0,\"\",'Data Input'!A170)","v":""},{"$f":"IF(ISBLANK('Data Input'!A170),\"\",COUNTIF('Data Input'!C170:AA170,\"\"))","v":""},{"$f":"IF(ISBLANK('Data Input'!A170),\"\",COUNTIF('Data Input'!C170:AA170,\"0\"))","v":""},{"$f":"IF(ISBLANK('Data Input'!A170),\"\",SUM(B165,C165))","v":""},{"$f":"IF(ISBLANK('Data Input'!A170),\"\",SUM('Data Input'!C170:AA170))","v":""},{"$f":"IF(E165=\"\",\"\",E165/(COUNTA('Data Input'!$C$8:$AA$8)))","v":""},{"$f":"IF(ISBLANK('Data Input'!A170),\"\",SUM('Data Input'!C170,'Data Input'!F170,'Data Input'!G170,'Data Input'!J170,'Data Input'!L170,'Data Input'!O170,'Data Input'!Q170,'Data Input'!R170,'Data Input'!U170))","v":""},{"$f":"IF(G165=\"\",\"\",G165/COUNTIF('Data Input'!$C$8:$AA$8,\"+\"))","v":""},{"$f":"IF(ISBLANK('Data Input'!A170),\"\",SUM('Data Input'!D170,'Data Input'!E170,'Data Input'!K170,'Data Input'!M170,'Data Input'!Y170))","v":""},{"$f":"IF(I165=\"\",\"\",I165/COUNTIF('Data Input'!$C$8:$AA$8,\"-\"))","v":""},{"$f":"IF(ISBLANK('Data Input'!A170),\"\",SUM('Data Input'!H170,'Data Input'!I170,'Data Input'!N170,'Data Input'!S170))","v":""},{"$f":"IF(K165=\"\",\"\",K165/COUNTIF('Data Input'!$C$8:$AA$8,\"x\"))","v":""},{"$f":"IF(ISBLANK('Data Input'!A170),\"\",SUM('Data Input'!P170,'Data Input'!V170,'Data Input'!W170))","v":""},{"$f":"IF(M165=\"\",\"\",M165/COUNTIF('Data Input'!$C$8:$AA$8,\"÷\"))","v":""},{"$f":"IF(ISBLANK('Data Input'!A170),\"\",SUM('Data Input'!T170,'Data Input'!X170,'Data Input'!Z170,'Data Input'!AA170))","v":""},{"$f":"IF(O165=\"\",\"\",O165/COUNTIF('Data Input'!$C$8:$AA$8,\"F\"))","v":""}]
[{"$f":"IF('Data Input'!A171=0,\"\",'Data Input'!A171)","v":""},{"$f":"IF(ISBLANK('Data Input'!A171),\"\",COUNTIF('Data Input'!C171:AA171,\"\"))","v":""},{"$f":"IF(ISBLANK('Data Input'!A171),\"\",COUNTIF('Data Input'!C171:AA171,\"0\"))","v":""},{"$f":"IF(ISBLANK('Data Input'!A171),\"\",SUM(B166,C166))","v":""},{"$f":"IF(ISBLANK('Data Input'!A171),\"\",SUM('Data Input'!C171:AA171))","v":""},{"$f":"IF(E166=\"\",\"\",E166/(COUNTA('Data Input'!$C$8:$AA$8)))","v":""},{"$f":"IF(ISBLANK('Data Input'!A171),\"\",SUM('Data Input'!C171,'Data Input'!F171,'Data Input'!G171,'Data Input'!J171,'Data Input'!L171,'Data Input'!O171,'Data Input'!Q171,'Data Input'!R171,'Data Input'!U171))","v":""},{"$f":"IF(G166=\"\",\"\",G166/COUNTIF('Data Input'!$C$8:$AA$8,\"+\"))","v":""},{"$f":"IF(ISBLANK('Data Input'!A171),\"\",SUM('Data Input'!D171,'Data Input'!E171,'Data Input'!K171,'Data Input'!M171,'Data Input'!Y171))","v":""},{"$f":"IF(I166=\"\",\"\",I166/COUNTIF('Data Input'!$C$8:$AA$8,\"-\"))","v":""},{"$f":"IF(ISBLANK('Data Input'!A171),\"\",SUM('Data Input'!H171,'Data Input'!I171,'Data Input'!N171,'Data Input'!S171))","v":""},{"$f":"IF(K166=\"\",\"\",K166/COUNTIF('Data Input'!$C$8:$AA$8,\"x\"))","v":""},{"$f":"IF(ISBLANK('Data Input'!A171),\"\",SUM('Data Input'!P171,'Data Input'!V171,'Data Input'!W171))","v":""},{"$f":"IF(M166=\"\",\"\",M166/COUNTIF('Data Input'!$C$8:$AA$8,\"÷\"))","v":""},{"$f":"IF(ISBLANK('Data Input'!A171),\"\",SUM('Data Input'!T171,'Data Input'!X171,'Data Input'!Z171,'Data Input'!AA171))","v":""},{"$f":"IF(O166=\"\",\"\",O166/COUNTIF('Data Input'!$C$8:$AA$8,\"F\"))","v":""}]
[{"$f":"IF('Data Input'!A172=0,\"\",'Data Input'!A172)","v":""},{"$f":"IF(ISBLANK('Data Input'!A172),\"\",COUNTIF('Data Input'!C172:AA172,\"\"))","v":""},{"$f":"IF(ISBLANK('Data Input'!A172),\"\",COUNTIF('Data Input'!C172:AA172,\"0\"))","v":""},{"$f":"IF(ISBLANK('Data Input'!A172),\"\",SUM(B167,C167))","v":""},{"$f":"IF(ISBLANK('Data Input'!A172),\"\",SUM('Data Input'!C172:AA172))","v":""},{"$f":"IF(E167=\"\",\"\",E167/(COUNTA('Data Input'!$C$8:$AA$8)))","v":""},{"$f":"IF(ISBLANK('Data Input'!A172),\"\",SUM('Data Input'!C172,'Data Input'!F172,'Data Input'!G172,'Data Input'!J172,'Data Input'!L172,'Data Input'!O172,'Data Input'!Q172,'Data Input'!R172,'Data Input'!U172))","v":""},{"$f":"IF(G167=\"\",\"\",G167/COUNTIF('Data Input'!$C$8:$AA$8,\"+\"))","v":""},{"$f":"IF(ISBLANK('Data Input'!A172),\"\",SUM('Data Input'!D172,'Data Input'!E172,'Data Input'!K172,'Data Input'!M172,'Data Input'!Y172))","v":""},{"$f":"IF(I167=\"\",\"\",I167/COUNTIF('Data Input'!$C$8:$AA$8,\"-\"))","v":""},{"$f":"IF(ISBLANK('Data Input'!A172),\"\",SUM('Data Input'!H172,'Data Input'!I172,'Data Input'!N172,'Data Input'!S172))","v":""},{"$f":"IF(K167=\"\",\"\",K167/COUNTIF('Data Input'!$C$8:$AA$8,\"x\"))","v":""},{"$f":"IF(ISBLANK('Data Input'!A172),\"\",SUM('Data Input'!P172,'Data Input'!V172,'Data Input'!W172))","v":""},{"$f":"IF(M167=\"\",\"\",M167/COUNTIF('Data Input'!$C$8:$AA$8,\"÷\"))","v":""},{"$f":"IF(ISBLANK('Data Input'!A172),\"\",SUM('Data Input'!T172,'Data Input'!X172,'Data Input'!Z172,'Data Input'!AA172))","v":""},{"$f":"IF(O167=\"\",\"\",O167/COUNTIF('Data Input'!$C$8:$AA$8,\"F\"))","v":""}]
[{"$f":"IF('Data Input'!A173=0,\"\",'Data Input'!A173)","v":""},{"$f":"IF(ISBLANK('Data Input'!A173),\"\",COUNTIF('Data Input'!C173:AA173,\"\"))","v":""},{"$f":"IF(ISBLANK('Data Input'!A173),\"\",COUNTIF('Data Input'!C173:AA173,\"0\"))","v":""},{"$f":"IF(ISBLANK('Data Input'!A173),\"\",SUM(B168,C168))","v":""},{"$f":"IF(ISBLANK('Data Input'!A173),\"\",SUM('Data Input'!C173:AA173))","v":""},{"$f":"IF(E168=\"\",\"\",E168/(COUNTA('Data Input'!$C$8:$AA$8)))","v":""},{"$f":"IF(ISBLANK('Data Input'!A173),\"\",SUM('Data Input'!C173,'Data Input'!F173,'Data Input'!G173,'Data Input'!J173,'Data Input'!L173,'Data Input'!O173,'Data Input'!Q173,'Data Input'!R173,'Data Input'!U173))","v":""},{"$f":"IF(G168=\"\",\"\",G168/COUNTIF('Data Input'!$C$8:$AA$8,\"+\"))","v":""},{"$f":"IF(ISBLANK('Data Input'!A173),\"\",SUM('Data Input'!D173,'Data Input'!E173,'Data Input'!K173,'Data Input'!M173,'Data Input'!Y173))","v":""},{"$f":"IF(I168=\"\",\"\",I168/COUNTIF('Data Input'!$C$8:$AA$8,\"-\"))","v":""},{"$f":"IF(ISBLANK('Data Input'!A173),\"\",SUM('Data Input'!H173,'Data Input'!I173,'Data Input'!N173,'Data Input'!S173))","v":""},{"$f":"IF(K168=\"\",\"\",K168/COUNTIF('Data Input'!$C$8:$AA$8,\"x\"))","v":""},{"$f":"IF(ISBLANK('Data Input'!A173),\"\",SUM('Data Input'!P173,'Data Input'!V173,'Data Input'!W173))","v":""},{"$f":"IF(M168=\"\",\"\",M168/COUNTIF('Data Input'!$C$8:$AA$8,\"÷\"))","v":""},{"$f":"IF(ISBLANK('Data Input'!A173),\"\",SUM('Data Input'!T173,'Data Input'!X173,'Data Input'!Z173,'Data Input'!AA173))","v":""},{"$f":"IF(O168=\"\",\"\",O168/COUNTIF('Data Input'!$C$8:$AA$8,\"F\"))","v":""}]
[{"$f":"IF('Data Input'!A174=0,\"\",'Data Input'!A174)","v":""},{"$f":"IF(ISBLANK('Data Input'!A174),\"\",COUNTIF('Data Input'!C174:AA174,\"\"))","v":""},{"$f":"IF(ISBLANK('Data Input'!A174),\"\",COUNTIF('Data Input'!C174:AA174,\"0\"))","v":""},{"$f":"IF(ISBLANK('Data Input'!A174),\"\",SUM(B169,C169))","v":""},{"$f":"IF(ISBLANK('Data Input'!A174),\"\",SUM('Data Input'!C174:AA174))","v":""},{"$f":"IF(E169=\"\",\"\",E169/(COUNTA('Data Input'!$C$8:$AA$8)))","v":""},{"$f":"IF(ISBLANK('Data Input'!A174),\"\",SUM('Data Input'!C174,'Data Input'!F174,'Data Input'!G174,'Data Input'!J174,'Data Input'!L174,'Data Input'!O174,'Data Input'!Q174,'Data Input'!R174,'Data Input'!U174))","v":""},{"$f":"IF(G169=\"\",\"\",G169/COUNTIF('Data Input'!$C$8:$AA$8,\"+\"))","v":""},{"$f":"IF(ISBLANK('Data Input'!A174),\"\",SUM('Data Input'!D174,'Data Input'!E174,'Data Input'!K174,'Data Input'!M174,'Data Input'!Y174))","v":""},{"$f":"IF(I169=\"\",\"\",I169/COUNTIF('Data Input'!$C$8:$AA$8,\"-\"))","v":""},{"$f":"IF(ISBLANK('Data Input'!A174),\"\",SUM('Data Input'!H174,'Data Input'!I174,'Data Input'!N174,'Data Input'!S174))","v":""},{"$f":"IF(K169=\"\",\"\",K169/COUNTIF('Data Input'!$C$8:$AA$8,\"x\"))","v":""},{"$f":"IF(ISBLANK('Data Input'!A174),\"\",SUM('Data Input'!P174,'Data Input'!V174,'Data Input'!W174))","v":""},{"$f":"IF(M169=\"\",\"\",M169/COUNTIF('Data Input'!$C$8:$AA$8,\"÷\"))","v":""},{"$f":"IF(ISBLANK('Data Input'!A174),\"\",SUM('Data Input'!T174,'Data Input'!X174,'Data Input'!Z174,'Data Input'!AA174))","v":""},{"$f":"IF(O169=\"\",\"\",O169/COUNTIF('Data Input'!$C$8:$AA$8,\"F\"))","v":""}]
[{"$f":"IF('Data Input'!A175=0,\"\",'Data Input'!A175)","v":""},{"$f":"IF(ISBLANK('Data Input'!A175),\"\",COUNTIF('Data Input'!C175:AA175,\"\"))","v":""},{"$f":"IF(ISBLANK('Data Input'!A175),\"\",COUNTIF('Data Input'!C175:AA175,\"0\"))","v":""},{"$f":"IF(ISBLANK('Data Input'!A175),\"\",SUM(B170,C170))","v":""},{"$f":"IF(ISBLANK('Data Input'!A175),\"\",SUM('Data Input'!C175:AA175))","v":""},{"$f":"IF(E170=\"\",\"\",E170/(COUNTA('Data Input'!$C$8:$AA$8)))","v":""},{"$f":"IF(ISBLANK('Data Input'!A175),\"\",SUM('Data Input'!C175,'Data Input'!F175,'Data Input'!G175,'Data Input'!J175,'Data Input'!L175,'Data Input'!O175,'Data Input'!Q175,'Data Input'!R175,'Data Input'!U175))","v":""},{"$f":"IF(G170=\"\",\"\",G170/COUNTIF('Data Input'!$C$8:$AA$8,\"+\"))","v":""},{"$f":"IF(ISBLANK('Data Input'!A175),\"\",SUM('Data Input'!D175,'Data Input'!E175,'Data Input'!K175,'Data Input'!M175,'Data Input'!Y175))","v":""},{"$f":"IF(I170=\"\",\"\",I170/COUNTIF('Data Input'!$C$8:$AA$8,\"-\"))","v":""},{"$f":"IF(ISBLANK('Data Input'!A175),\"\",SUM('Data Input'!H175,'Data Input'!I175,'Data Input'!N175,'Data Input'!S175))","v":""},{"$f":"IF(K170=\"\",\"\",K170/COUNTIF('Data Input'!$C$8:$AA$8,\"x\"))","v":""},{"$f":"IF(ISBLANK('Data Input'!A175),\"\",SUM('Data Input'!P175,'Data Input'!V175,'Data Input'!W175))","v":""},{"$f":"IF(M170=\"\",\"\",M170/COUNTIF('Data Input'!$C$8:$AA$8,\"÷\"))","v":""},{"$f":"IF(ISBLANK('Data Input'!A175),\"\",SUM('Data Input'!T175,'Data Input'!X175,'Data Input'!Z175,'Data Input'!AA175))","v":""},{"$f":"IF(O170=\"\",\"\",O170/COUNTIF('Data Input'!$C$8:$AA$8,\"F\"))","v":""}]
[{"$f":"IF('Data Input'!A176=0,\"\",'Data Input'!A176)","v":""},{"$f":"IF(ISBLANK('Data Input'!A176),\"\",COUNTIF('Data Input'!C176:AA176,\"\"))","v":""},{"$f":"IF(ISBLANK('Data Input'!A176),\"\",COUNTIF('Data Input'!C176:AA176,\"0\"))","v":""},{"$f":"IF(ISBLANK('Data Input'!A176),\"\",SUM(B171,C171))","v":""},{"$f":"IF(ISBLANK('Data Input'!A176),\"\",SUM('Data Input'!C176:AA176))","v":""},{"$f":"IF(E171=\"\",\"\",E171/(COUNTA('Data Input'!$C$8:$AA$8)))","v":""},{"$f":"IF(ISBLANK('Data Input'!A176),\"\",SUM('Data Input'!C176,'Data Input'!F176,'Data Input'!G176,'Data Input'!J176,'Data Input'!L176,'Data Input'!O176,'Data Input'!Q176,'Data Input'!R176,'Data Input'!U176))","v":""},{"$f":"IF(G171=\"\",\"\",G171/COUNTIF('Data Input'!$C$8:$AA$8,\"+\"))","v":""},{"$f":"IF(ISBLANK('Data Input'!A176),\"\",SUM('Data Input'!D176,'Data Input'!E176,'Data Input'!K176,'Data Input'!M176,'Data Input'!Y176))","v":""},{"$f":"IF(I171=\"\",\"\",I171/COUNTIF('Data Input'!$C$8:$AA$8,\"-\"))","v":""},{"$f":"IF(ISBLANK('Data Input'!A176),\"\",SUM('Data Input'!H176,'Data Input'!I176,'Data Input'!N176,'Data Input'!S176))","v":""},{"$f":"IF(K171=\"\",\"\",K171/COUNTIF('Data Input'!$C$8:$AA$8,\"x\"))","v":""},{"$f":"IF(ISBLANK('Data Input'!A176),\"\",SUM('Data Input'!P176,'Data Input'!V176,'Data Input'!W176))","v":""},{"$f":"IF(M171=\"\",\"\",M171/COUNTIF('Data Input'!$C$8:$AA$8,\"÷\"))","v":""},{"$f":"IF(ISBLANK('Data Input'!A176),\"\",SUM('Data Input'!T176,'Data Input'!X176,'Data Input'!Z176,'Data Input'!AA176))","v":""},{"$f":"IF(O171=\"\",\"\",O171/COUNTIF('Data Input'!$C$8:$AA$8,\"F\"))","v":""}]
[{"$f":"IF('Data Input'!A177=0,\"\",'Data Input'!A177)","v":""},{"$f":"IF(ISBLANK('Data Input'!A177),\"\",COUNTIF('Data Input'!C177:AA177,\"\"))","v":""},{"$f":"IF(ISBLANK('Data Input'!A177),\"\",COUNTIF('Data Input'!C177:AA177,\"0\"))","v":""},{"$f":"IF(ISBLANK('Data Input'!A177),\"\",SUM(B172,C172))","v":""},{"$f":"IF(ISBLANK('Data Input'!A177),\"\",SUM('Data Input'!C177:AA177))","v":""},{"$f":"IF(E172=\"\",\"\",E172/(COUNTA('Data Input'!$C$8:$AA$8)))","v":""},{"$f":"IF(ISBLANK('Data Input'!A177),\"\",SUM('Data Input'!C177,'Data Input'!F177,'Data Input'!G177,'Data Input'!J177,'Data Input'!L177,'Data Input'!O177,'Data Input'!Q177,'Data Input'!R177,'Data Input'!U177))","v":""},{"$f":"IF(G172=\"\",\"\",G172/COUNTIF('Data Input'!$C$8:$AA$8,\"+\"))","v":""},{"$f":"IF(ISBLANK('Data Input'!A177),\"\",SUM('Data Input'!D177,'Data Input'!E177,'Data Input'!K177,'Data Input'!M177,'Data Input'!Y177))","v":""},{"$f":"IF(I172=\"\",\"\",I172/COUNTIF('Data Input'!$C$8:$AA$8,\"-\"))","v":""},{"$f":"IF(ISBLANK('Data Input'!A177),\"\",SUM('Data Input'!H177,'Data Input'!I177,'Data Input'!N177,'Data Input'!S177))","v":""},{"$f":"IF(K172=\"\",\"\",K172/COUNTIF('Data Input'!$C$8:$AA$8,\"x\"))","v":""},{"$f":"IF(ISBLANK('Data Input'!A177),\"\",SUM('Data Input'!P177,'Data Input'!V177,'Data Input'!W177))","v":""},{"$f":"IF(M172=\"\",\"\",M172/COUNTIF('Data Input'!$C$8:$AA$8,\"÷\"))","v":""},{"$f":"IF(ISBLANK('Data Input'!A177),\"\",SUM('Data Input'!T177,'Data Input'!X177,'Data Input'!Z177,'Data Input'!AA177))","v":""},{"$f":"IF(O172=\"\",\"\",O172/COUNTIF('Data Input'!$C$8:$AA$8,\"F\"))","v":""}]
[{"$f":"IF('Data Input'!A178=0,\"\",'Data Input'!A178)","v":""},{"$f":"IF(ISBLANK('Data Input'!A178),\"\",COUNTIF('Data Input'!C178:AA178,\"\"))","v":""},{"$f":"IF(ISBLANK('Data Input'!A178),\"\",COUNTIF('Data Input'!C178:AA178,\"0\"))","v":""},{"$f":"IF(ISBLANK('Data Input'!A178),\"\",SUM(B173,C173))","v":""},{"$f":"IF(ISBLANK('Data Input'!A178),\"\",SUM('Data Input'!C178:AA178))","v":""},{"$f":"IF(E173=\"\",\"\",E173/(COUNTA('Data Input'!$C$8:$AA$8)))","v":""},{"$f":"IF(ISBLANK('Data Input'!A178),\"\",SUM('Data Input'!C178,'Data Input'!F178,'Data Input'!G178,'Data Input'!J178,'Data Input'!L178,'Data Input'!O178,'Data Input'!Q178,'Data Input'!R178,'Data Input'!U178))","v":""},{"$f":"IF(G173=\"\",\"\",G173/COUNTIF('Data Input'!$C$8:$AA$8,\"+\"))","v":""},{"$f":"IF(ISBLANK('Data Input'!A178),\"\",SUM('Data Input'!D178,'Data Input'!E178,'Data Input'!K178,'Data Input'!M178,'Data Input'!Y178))","v":""},{"$f":"IF(I173=\"\",\"\",I173/COUNTIF('Data Input'!$C$8:$AA$8,\"-\"))","v":""},{"$f":"IF(ISBLANK('Data Input'!A178),\"\",SUM('Data Input'!H178,'Data Input'!I178,'Data Input'!N178,'Data Input'!S178))","v":""},{"$f":"IF(K173=\"\",\"\",K173/COUNTIF('Data Input'!$C$8:$AA$8,\"x\"))","v":""},{"$f":"IF(ISBLANK('Data Input'!A178),\"\",SUM('Data Input'!P178,'Data Input'!V178,'Data Input'!W178))","v":""},{"$f":"IF(M173=\"\",\"\",M173/COUNTIF('Data Input'!$C$8:$AA$8,\"÷\"))","v":""},{"$f":"IF(ISBLANK('Data Input'!A178),\"\",SUM('Data Input'!T178,'Data Input'!X178,'Data Input'!Z178,'Data Input'!AA178))","v":""},{"$f":"IF(O173=\"\",\"\",O173/COUNTIF('Data Input'!$C$8:$AA$8,\"F\"))","v":""}]
[{"$f":"IF('Data Input'!A179=0,\"\",'Data Input'!A179)","v":""},{"$f":"IF(ISBLANK('Data Input'!A179),\"\",COUNTIF('Data Input'!C179:AA179,\"\"))","v":""},{"$f":"IF(ISBLANK('Data Input'!A179),\"\",COUNTIF('Data Input'!C179:AA179,\"0\"))","v":""},{"$f":"IF(ISBLANK('Data Input'!A179),\"\",SUM(B174,C174))","v":""},{"$f":"IF(ISBLANK('Data Input'!A179),\"\",SUM('Data Input'!C179:AA179))","v":""},{"$f":"IF(E174=\"\",\"\",E174/(COUNTA('Data Input'!$C$8:$AA$8)))","v":""},{"$f":"IF(ISBLANK('Data Input'!A179),\"\",SUM('Data Input'!C179,'Data Input'!F179,'Data Input'!G179,'Data Input'!J179,'Data Input'!L179,'Data Input'!O179,'Data Input'!Q179,'Data Input'!R179,'Data Input'!U179))","v":""},{"$f":"IF(G174=\"\",\"\",G174/COUNTIF('Data Input'!$C$8:$AA$8,\"+\"))","v":""},{"$f":"IF(ISBLANK('Data Input'!A179),\"\",SUM('Data Input'!D179,'Data Input'!E179,'Data Input'!K179,'Data Input'!M179,'Data Input'!Y179))","v":""},{"$f":"IF(I174=\"\",\"\",I174/COUNTIF('Data Input'!$C$8:$AA$8,\"-\"))","v":""},{"$f":"IF(ISBLANK('Data Input'!A179),\"\",SUM('Data Input'!H179,'Data Input'!I179,'Data Input'!N179,'Data Input'!S179))","v":""},{"$f":"IF(K174=\"\",\"\",K174/COUNTIF('Data Input'!$C$8:$AA$8,\"x\"))","v":""},{"$f":"IF(ISBLANK('Data Input'!A179),\"\",SUM('Data Input'!P179,'Data Input'!V179,'Data Input'!W179))","v":""},{"$f":"IF(M174=\"\",\"\",M174/COUNTIF('Data Input'!$C$8:$AA$8,\"÷\"))","v":""},{"$f":"IF(ISBLANK('Data Input'!A179),\"\",SUM('Data Input'!T179,'Data Input'!X179,'Data Input'!Z179,'Data Input'!AA179))","v":""},{"$f":"IF(O174=\"\",\"\",O174/COUNTIF('Data Input'!$C$8:$AA$8,\"F\"))","v":""}]
[{"$f":"IF('Data Input'!A180=0,\"\",'Data Input'!A180)","v":""},{"$f":"IF(ISBLANK('Data Input'!A180),\"\",COUNTIF('Data Input'!C180:AA180,\"\"))","v":""},{"$f":"IF(ISBLANK('Data Input'!A180),\"\",COUNTIF('Data Input'!C180:AA180,\"0\"))","v":""},{"$f":"IF(ISBLANK('Data Input'!A180),\"\",SUM(B175,C175))","v":""},{"$f":"IF(ISBLANK('Data Input'!A180),\"\",SUM('Data Input'!C180:AA180))","v":""},{"$f":"IF(E175=\"\",\"\",E175/(COUNTA('Data Input'!$C$8:$AA$8)))","v":""},{"$f":"IF(ISBLANK('Data Input'!A180),\"\",SUM('Data Input'!C180,'Data Input'!F180,'Data Input'!G180,'Data Input'!J180,'Data Input'!L180,'Data Input'!O180,'Data Input'!Q180,'Data Input'!R180,'Data Input'!U180))","v":""},{"$f":"IF(G175=\"\",\"\",G175/COUNTIF('Data Input'!$C$8:$AA$8,\"+\"))","v":""},{"$f":"IF(ISBLANK('Data Input'!A180),\"\",SUM('Data Input'!D180,'Data Input'!E180,'Data Input'!K180,'Data Input'!M180,'Data Input'!Y180))","v":""},{"$f":"IF(I175=\"\",\"\",I175/COUNTIF('Data Input'!$C$8:$AA$8,\"-\"))","v":""},{"$f":"IF(ISBLANK('Data Input'!A180),\"\",SUM('Data Input'!H180,'Data Input'!I180,'Data Input'!N180,'Data Input'!S180))","v":""},{"$f":"IF(K175=\"\",\"\",K175/COUNTIF('Data Input'!$C$8:$AA$8,\"x\"))","v":""},{"$f":"IF(ISBLANK('Data Input'!A180),\"\",SUM('Data Input'!P180,'Data Input'!V180,'Data Input'!W180))","v":""},{"$f":"IF(M175=\"\",\"\",M175/COUNTIF('Data Input'!$C$8:$AA$8,\"÷\"))","v":""},{"$f":"IF(ISBLANK('Data Input'!A180),\"\",SUM('Data Input'!T180,'Data Input'!X180,'Data Input'!Z180,'Data Input'!AA180))","v":""},{"$f":"IF(O175=\"\",\"\",O175/COUNTIF('Data Input'!$C$8:$AA$8,\"F\"))","v":""}]
[{"$f":"IF('Data Input'!A181=0,\"\",'Data Input'!A181)","v":""},{"$f":"IF(ISBLANK('Data Input'!A181),\"\",COUNTIF('Data Input'!C181:AA181,\"\"))","v":""},{"$f":"IF(ISBLANK('Data Input'!A181),\"\",COUNTIF('Data Input'!C181:AA181,\"0\"))","v":""},{"$f":"IF(ISBLANK('Data Input'!A181),\"\",SUM(B176,C176))","v":""},{"$f":"IF(ISBLANK('Data Input'!A181),\"\",SUM('Data Input'!C181:AA181))","v":""},{"$f":"IF(E176=\"\",\"\",E176/(COUNTA('Data Input'!$C$8:$AA$8)))","v":""},{"$f":"IF(ISBLANK('Data Input'!A181),\"\",SUM('Data Input'!C181,'Data Input'!F181,'Data Input'!G181,'Data Input'!J181,'Data Input'!L181,'Data Input'!O181,'Data Input'!Q181,'Data Input'!R181,'Data Input'!U181))","v":""},{"$f":"IF(G176=\"\",\"\",G176/COUNTIF('Data Input'!$C$8:$AA$8,\"+\"))","v":""},{"$f":"IF(ISBLANK('Data Input'!A181),\"\",SUM('Data Input'!D181,'Data Input'!E181,'Data Input'!K181,'Data Input'!M181,'Data Input'!Y181))","v":""},{"$f":"IF(I176=\"\",\"\",I176/COUNTIF('Data Input'!$C$8:$AA$8,\"-\"))","v":""},{"$f":"IF(ISBLANK('Data Input'!A181),\"\",SUM('Data Input'!H181,'Data Input'!I181,'Data Input'!N181,'Data Input'!S181))","v":""},{"$f":"IF(K176=\"\",\"\",K176/COUNTIF('Data Input'!$C$8:$AA$8,\"x\"))","v":""},{"$f":"IF(ISBLANK('Data Input'!A181),\"\",SUM('Data Input'!P181,'Data Input'!V181,'Data Input'!W181))","v":""},{"$f":"IF(M176=\"\",\"\",M176/COUNTIF('Data Input'!$C$8:$AA$8,\"÷\"))","v":""},{"$f":"IF(ISBLANK('Data Input'!A181),\"\",SUM('Data Input'!T181,'Data Input'!X181,'Data Input'!Z181,'Data Input'!AA181))","v":""},{"$f":"IF(O176=\"\",\"\",O176/COUNTIF('Data Input'!$C$8:$AA$8,\"F\"))","v":""}]
[{"$f":"IF('Data Input'!A182=0,\"\",'Data Input'!A182)","v":""},{"$f":"IF(ISBLANK('Data Input'!A182),\"\",COUNTIF('Data Input'!C182:AA182,\"\"))","v":""},{"$f":"IF(ISBLANK('Data Input'!A182),\"\",COUNTIF('Data Input'!C182:AA182,\"0\"))","v":""},{"$f":"IF(ISBLANK('Data Input'!A182),\"\",SUM(B177,C177))","v":""},{"$f":"IF(ISBLANK('Data Input'!A182),\"\",SUM('Data Input'!C182:AA182))","v":""},{"$f":"IF(E177=\"\",\"\",E177/(COUNTA('Data Input'!$C$8:$AA$8)))","v":""},{"$f":"IF(ISBLANK('Data Input'!A182),\"\",SUM('Data Input'!C182,'Data Input'!F182,'Data Input'!G182,'Data Input'!J182,'Data Input'!L182,'Data Input'!O182,'Data Input'!Q182,'Data Input'!R182,'Data Input'!U182))","v":""},{"$f":"IF(G177=\"\",\"\",G177/COUNTIF('Data Input'!$C$8:$AA$8,\"+\"))","v":""},{"$f":"IF(ISBLANK('Data Input'!A182),\"\",SUM('Data Input'!D182,'Data Input'!E182,'Data Input'!K182,'Data Input'!M182,'Data Input'!Y182))","v":""},{"$f":"IF(I177=\"\",\"\",I177/COUNTIF('Data Input'!$C$8:$AA$8,\"-\"))","v":""},{"$f":"IF(ISBLANK('Data Input'!A182),\"\",SUM('Data Input'!H182,'Data Input'!I182,'Data Input'!N182,'Data Input'!S182))","v":""},{"$f":"IF(K177=\"\",\"\",K177/COUNTIF('Data Input'!$C$8:$AA$8,\"x\"))","v":""},{"$f":"IF(ISBLANK('Data Input'!A182),\"\",SUM('Data Input'!P182,'Data Input'!V182,'Data Input'!W182))","v":""},{"$f":"IF(M177=\"\",\"\",M177/COUNTIF('Data Input'!$C$8:$AA$8,\"÷\"))","v":""},{"$f":"IF(ISBLANK('Data Input'!A182),\"\",SUM('Data Input'!T182,'Data Input'!X182,'Data Input'!Z182,'Data Input'!AA182))","v":""},{"$f":"IF(O177=\"\",\"\",O177/COUNTIF('Data Input'!$C$8:$AA$8,\"F\"))","v":""}]
[{"$f":"IF('Data Input'!A183=0,\"\",'Data Input'!A183)","v":""},{"$f":"IF(ISBLANK('Data Input'!A183),\"\",COUNTIF('Data Input'!C183:AA183,\"\"))","v":""},{"$f":"IF(ISBLANK('Data Input'!A183),\"\",COUNTIF('Data Input'!C183:AA183,\"0\"))","v":""},{"$f":"IF(ISBLANK('Data Input'!A183),\"\",SUM(B178,C178))","v":""},{"$f":"IF(ISBLANK('Data Input'!A183),\"\",SUM('Data Input'!C183:AA183))","v":""},{"$f":"IF(E178=\"\",\"\",E178/(COUNTA('Data Input'!$C$8:$AA$8)))","v":""},{"$f":"IF(ISBLANK('Data Input'!A183),\"\",SUM('Data Input'!C183,'Data Input'!F183,'Data Input'!G183,'Data Input'!J183,'Data Input'!L183,'Data Input'!O183,'Data Input'!Q183,'Data Input'!R183,'Data Input'!U183))","v":""},{"$f":"IF(G178=\"\",\"\",G178/COUNTIF('Data Input'!$C$8:$AA$8,\"+\"))","v":""},{"$f":"IF(ISBLANK('Data Input'!A183),\"\",SUM('Data Input'!D183,'Data Input'!E183,'Data Input'!K183,'Data Input'!M183,'Data Input'!Y183))","v":""},{"$f":"IF(I178=\"\",\"\",I178/COUNTIF('Data Input'!$C$8:$AA$8,\"-\"))","v":""},{"$f":"IF(ISBLANK('Data Input'!A183),\"\",SUM('Data Input'!H183,'Data Input'!I183,'Data Input'!N183,'Data Input'!S183))","v":""},{"$f":"IF(K178=\"\",\"\",K178/COUNTIF('Data Input'!$C$8:$AA$8,\"x\"))","v":""},{"$f":"IF(ISBLANK('Data Input'!A183),\"\",SUM('Data Input'!P183,'Data Input'!V183,'Data Input'!W183))","v":""},{"$f":"IF(M178=\"\",\"\",M178/COUNTIF('Data Input'!$C$8:$AA$8,\"÷\"))","v":""},{"$f":"IF(ISBLANK('Data Input'!A183),\"\",SUM('Data Input'!T183,'Data Input'!X183,'Data Input'!Z183,'Data Input'!AA183))","v":""},{"$f":"IF(O178=\"\",\"\",O178/COUNTIF('Data Input'!$C$8:$AA$8,\"F\"))","v":""}]
[{"$f":"IF('Data Input'!A184=0,\"\",'Data Input'!A184)","v":""},{"$f":"IF(ISBLANK('Data Input'!A184),\"\",COUNTIF('Data Input'!C184:AA184,\"\"))","v":""},{"$f":"IF(ISBLANK('Data Input'!A184),\"\",COUNTIF('Data Input'!C184:AA184,\"0\"))","v":""},{"$f":"IF(ISBLANK('Data Input'!A184),\"\",SUM(B179,C179))","v":""},{"$f":"IF(ISBLANK('Data Input'!A184),\"\",SUM('Data Input'!C184:AA184))","v":""},{"$f":"IF(E179=\"\",\"\",E179/(COUNTA('Data Input'!$C$8:$AA$8)))","v":""},{"$f":"IF(ISBLANK('Data Input'!A184),\"\",SUM('Data Input'!C184,'Data Input'!F184,'Data Input'!G184,'Data Input'!J184,'Data Input'!L184,'Data Input'!O184,'Data Input'!Q184,'Data Input'!R184,'Data Input'!U184))","v":""},{"$f":"IF(G179=\"\",\"\",G179/COUNTIF('Data Input'!$C$8:$AA$8,\"+\"))","v":""},{"$f":"IF(ISBLANK('Data Input'!A184),\"\",SUM('Data Input'!D184,'Data Input'!E184,'Data Input'!K184,'Data Input'!M184,'Data Input'!Y184))","v":""},{"$f":"IF(I179=\"\",\"\",I179/COUNTIF('Data Input'!$C$8:$AA$8,\"-\"))","v":""},{"$f":"IF(ISBLANK('Data Input'!A184),\"\",SUM('Data Input'!H184,'Data Input'!I184,'Data Input'!N184,'Data Input'!S184))","v":""},{"$f":"IF(K179=\"\",\"\",K179/COUNTIF('Data Input'!$C$8:$AA$8,\"x\"))","v":""},{"$f":"IF(ISBLANK('Data Input'!A184),\"\",SUM('Data Input'!P184,'Data Input'!V184,'Data Input'!W184))","v":""},{"$f":"IF(M179=\"\",\"\",M179/COUNTIF('Data Input'!$C$8:$AA$8,\"÷\"))","v":""},{"$f":"IF(ISBLANK('Data Input'!A184),\"\",SUM('Data Input'!T184,'Data Input'!X184,'Data Input'!Z184,'Data Input'!AA184))","v":""},{"$f":"IF(O179=\"\",\"\",O179/COUNTIF('Data Input'!$C$8:$AA$8,\"F\"))","v":""}]
[{"$f":"IF('Data Input'!A185=0,\"\",'Data Input'!A185)","v":""},{"$f":"IF(ISBLANK('Data Input'!A185),\"\",COUNTIF('Data Input'!C185:AA185,\"\"))","v":""},{"$f":"IF(ISBLANK('Data Input'!A185),\"\",COUNTIF('Data Input'!C185:AA185,\"0\"))","v":""},{"$f":"IF(ISBLANK('Data Input'!A185),\"\",SUM(B180,C180))","v":""},{"$f":"IF(ISBLANK('Data Input'!A185),\"\",SUM('Data Input'!C185:AA185))","v":""},{"$f":"IF(E180=\"\",\"\",E180/(COUNTA('Data Input'!$C$8:$AA$8)))","v":""},{"$f":"IF(ISBLANK('Data Input'!A185),\"\",SUM('Data Input'!C185,'Data Input'!F185,'Data Input'!G185,'Data Input'!J185,'Data Input'!L185,'Data Input'!O185,'Data Input'!Q185,'Data Input'!R185,'Data Input'!U185))","v":""},{"$f":"IF(G180=\"\",\"\",G180/COUNTIF('Data Input'!$C$8:$AA$8,\"+\"))","v":""},{"$f":"IF(ISBLANK('Data Input'!A185),\"\",SUM('Data Input'!D185,'Data Input'!E185,'Data Input'!K185,'Data Input'!M185,'Data Input'!Y185))","v":""},{"$f":"IF(I180=\"\",\"\",I180/COUNTIF('Data Input'!$C$8:$AA$8,\"-\"))","v":""},{"$f":"IF(ISBLANK('Data Input'!A185),\"\",SUM('Data Input'!H185,'Data Input'!I185,'Data Input'!N185,'Data Input'!S185))","v":""},{"$f":"IF(K180=\"\",\"\",K180/COUNTIF('Data Input'!$C$8:$AA$8,\"x\"))","v":""},{"$f":"IF(ISBLANK('Data Input'!A185),\"\",SUM('Data Input'!P185,'Data Input'!V185,'Data Input'!W185))","v":""},{"$f":"IF(M180=\"\",\"\",M180/COUNTIF('Data Input'!$C$8:$AA$8,\"÷\"))","v":""},{"$f":"IF(ISBLANK('Data Input'!A185),\"\",SUM('Data Input'!T185,'Data Input'!X185,'Data Input'!Z185,'Data Input'!AA185))","v":""},{"$f":"IF(O180=\"\",\"\",O180/COUNTIF('Data Input'!$C$8:$AA$8,\"F\"))","v":""}]
[{"$f":"IF('Data Input'!A186=0,\"\",'Data Input'!A186)","v":""},{"$f":"IF(ISBLANK('Data Input'!A186),\"\",COUNTIF('Data Input'!C186:AA186,\"\"))","v":""},{"$f":"IF(ISBLANK('Data Input'!A186),\"\",COUNTIF('Data Input'!C186:AA186,\"0\"))","v":""},{"$f":"IF(ISBLANK('Data Input'!A186),\"\",SUM(B181,C181))","v":""},{"$f":"IF(ISBLANK('Data Input'!A186),\"\",SUM('Data Input'!C186:AA186))","v":""},{"$f":"IF(E181=\"\",\"\",E181/(COUNTA('Data Input'!$C$8:$AA$8)))","v":""},{"$f":"IF(ISBLANK('Data Input'!A186),\"\",SUM('Data Input'!C186,'Data Input'!F186,'Data Input'!G186,'Data Input'!J186,'Data Input'!L186,'Data Input'!O186,'Data Input'!Q186,'Data Input'!R186,'Data Input'!U186))","v":""},{"$f":"IF(G181=\"\",\"\",G181/COUNTIF('Data Input'!$C$8:$AA$8,\"+\"))","v":""},{"$f":"IF(ISBLANK('Data Input'!A186),\"\",SUM('Data Input'!D186,'Data Input'!E186,'Data Input'!K186,'Data Input'!M186,'Data Input'!Y186))","v":""},{"$f":"IF(I181=\"\",\"\",I181/COUNTIF('Data Input'!$C$8:$AA$8,\"-\"))","v":""},{"$f":"IF(ISBLANK('Data Input'!A186),\"\",SUM('Data Input'!H186,'Data Input'!I186,'Data Input'!N186,'Data Input'!S186))","v":""},{"$f":"IF(K181=\"\",\"\",K181/COUNTIF('Data Input'!$C$8:$AA$8,\"x\"))","v":""},{"$f":"IF(ISBLANK('Data Input'!A186),\"\",SUM('Data Input'!P186,'Data Input'!V186,'Data Input'!W186))","v":""},{"$f":"IF(M181=\"\",\"\",M181/COUNTIF('Data Input'!$C$8:$AA$8,\"÷\"))","v":""},{"$f":"IF(ISBLANK('Data Input'!A186),\"\",SUM('Data Input'!T186,'Data Input'!X186,'Data Input'!Z186,'Data Input'!AA186))","v":""},{"$f":"IF(O181=\"\",\"\",O181/COUNTIF('Data Input'!$C$8:$AA$8,\"F\"))","v":""}]
[{"$f":"IF('Data Input'!A187=0,\"\",'Data Input'!A187)","v":""},{"$f":"IF(ISBLANK('Data Input'!A187),\"\",COUNTIF('Data Input'!C187:AA187,\"\"))","v":""},{"$f":"IF(ISBLANK('Data Input'!A187),\"\",COUNTIF('Data Input'!C187:AA187,\"0\"))","v":""},{"$f":"IF(ISBLANK('Data Input'!A187),\"\",SUM(B182,C182))","v":""},{"$f":"IF(ISBLANK('Data Input'!A187),\"\",SUM('Data Input'!C187:AA187))","v":""},{"$f":"IF(E182=\"\",\"\",E182/(COUNTA('Data Input'!$C$8:$AA$8)))","v":""},{"$f":"IF(ISBLANK('Data Input'!A187),\"\",SUM('Data Input'!C187,'Data Input'!F187,'Data Input'!G187,'Data Input'!J187,'Data Input'!L187,'Data Input'!O187,'Data Input'!Q187,'Data Input'!R187,'Data Input'!U187))","v":""},{"$f":"IF(G182=\"\",\"\",G182/COUNTIF('Data Input'!$C$8:$AA$8,\"+\"))","v":""},{"$f":"IF(ISBLANK('Data Input'!A187),\"\",SUM('Data Input'!D187,'Data Input'!E187,'Data Input'!K187,'Data Input'!M187,'Data Input'!Y187))","v":""},{"$f":"IF(I182=\"\",\"\",I182/COUNTIF('Data Input'!$C$8:$AA$8,\"-\"))","v":""},{"$f":"IF(ISBLANK('Data Input'!A187),\"\",SUM('Data Input'!H187,'Data Input'!I187,'Data Input'!N187,'Data Input'!S187))","v":""},{"$f":"IF(K182=\"\",\"\",K182/COUNTIF('Data Input'!$C$8:$AA$8,\"x\"))","v":""},{"$f":"IF(ISBLANK('Data Input'!A187),\"\",SUM('Data Input'!P187,'Data Input'!V187,'Data Input'!W187))","v":""},{"$f":"IF(M182=\"\",\"\",M182/COUNTIF('Data Input'!$C$8:$AA$8,\"÷\"))","v":""},{"$f":"IF(ISBLANK('Data Input'!A187),\"\",SUM('Data Input'!T187,'Data Input'!X187,'Data Input'!Z187,'Data Input'!AA187))","v":""},{"$f":"IF(O182=\"\",\"\",O182/COUNTIF('Data Input'!$C$8:$AA$8,\"F\"))","v":""}]
[{"$f":"IF('Data Input'!A188=0,\"\",'Data Input'!A188)","v":""},{"$f":"IF(ISBLANK('Data Input'!A188),\"\",COUNTIF('Data Input'!C188:AA188,\"\"))","v":""},{"$f":"IF(ISBLANK('Data Input'!A188),\"\",COUNTIF('Data Input'!C188:AA188,\"0\"))","v":""},{"$f":"IF(ISBLANK('Data Input'!A188),\"\",SUM(B183,C183))","v":""},{"$f":"IF(ISBLANK('Data Input'!A188),\"\",SUM('Data Input'!C188:AA188))","v":""},{"$f":"IF(E183=\"\",\"\",E183/(COUNTA('Data Input'!$C$8:$AA$8)))","v":""},{"$f":"IF(ISBLANK('Data Input'!A188),\"\",SUM('Data Input'!C188,'Data Input'!F188,'Data Input'!G188,'Data Input'!J188,'Data Input'!L188,'Data Input'!O188,'Data Input'!Q188,'Data Input'!R188,'Data Input'!U188))","v":""},{"$f":"IF(G183=\"\",\"\",G183/COUNTIF('Data Input'!$C$8:$AA$8,\"+\"))","v":""},{"$f":"IF(ISBLANK('Data Input'!A188),\"\",SUM('Data Input'!D188,'Data Input'!E188,'Data Input'!K188,'Data Input'!M188,'Data Input'!Y188))","v":""},{"$f":"IF(I183=\"\",\"\",I183/COUNTIF('Data Input'!$C$8:$AA$8,\"-\"))","v":""},{"$f":"IF(ISBLANK('Data Input'!A188),\"\",SUM('Data Input'!H188,'Data Input'!I188,'Data Input'!N188,'Data Input'!S188))","v":""},{"$f":"IF(K183=\"\",\"\",K183/COUNTIF('Data Input'!$C$8:$AA$8,\"x\"))","v":""},{"$f":"IF(ISBLANK('Data Input'!A188),\"\",SUM('Data Input'!P188,'Data Input'!V188,'Data Input'!W188))","v":""},{"$f":"IF(M183=\"\",\"\",M183/COUNTIF('Data Input'!$C$8:$AA$8,\"÷\"))","v":""},{"$f":"IF(ISBLANK('Data Input'!A188),\"\",SUM('Data Input'!T188,'Data Input'!X188,'Data Input'!Z188,'Data Input'!AA188))","v":""},{"$f":"IF(O183=\"\",\"\",O183/COUNTIF('Data Input'!$C$8:$AA$8,\"F\"))","v":""}]
[{"$f":"IF('Data Input'!A189=0,\"\",'Data Input'!A189)","v":""},{"$f":"IF(ISBLANK('Data Input'!A189),\"\",COUNTIF('Data Input'!C189:AA189,\"\"))","v":""},{"$f":"IF(ISBLANK('Data Input'!A189),\"\",COUNTIF('Data Input'!C189:AA189,\"0\"))","v":""},{"$f":"IF(ISBLANK('Data Input'!A189),\"\",SUM(B184,C184))","v":""},{"$f":"IF(ISBLANK('Data Input'!A189),\"\",SUM('Data Input'!C189:AA189))","v":""},{"$f":"IF(E184=\"\",\"\",E184/(COUNTA('Data Input'!$C$8:$AA$8)))","v":""},{"$f":"IF(ISBLANK('Data Input'!A189),\"\",SUM('Data Input'!C189,'Data Input'!F189,'Data Input'!G189,'Data Input'!J189,'Data Input'!L189,'Data Input'!O189,'Data Input'!Q189,'Data Input'!R189,'Data Input'!U189))","v":""},{"$f":"IF(G184=\"\",\"\",G184/COUNTIF('Data Input'!$C$8:$AA$8,\"+\"))","v":""},{"$f":"IF(ISBLANK('Data Input'!A189),\"\",SUM('Data Input'!D189,'Data Input'!E189,'Data Input'!K189,'Data Input'!M189,'Data Input'!Y189))","v":""},{"$f":"IF(I184=\"\",\"\",I184/COUNTIF('Data Input'!$C$8:$AA$8,\"-\"))","v":""},{"$f":"IF(ISBLANK('Data Input'!A189),\"\",SUM('Data Input'!H189,'Data Input'!I189,'Data Input'!N189,'Data Input'!S189))","v":""},{"$f":"IF(K184=\"\",\"\",K184/COUNTIF('Data Input'!$C$8:$AA$8,\"x\"))","v":""},{"$f":"IF(ISBLANK('Data Input'!A189),\"\",SUM('Data Input'!P189,'Data Input'!V189,'Data Input'!W189))","v":""},{"$f":"IF(M184=\"\",\"\",M184/COUNTIF('Data Input'!$C$8:$AA$8,\"÷\"))","v":""},{"$f":"IF(ISBLANK('Data Input'!A189),\"\",SUM('Data Input'!T189,'Data Input'!X189,'Data Input'!Z189,'Data Input'!AA189))","v":""},{"$f":"IF(O184=\"\",\"\",O184/COUNTIF('Data Input'!$C$8:$AA$8,\"F\"))","v":""}]
[{"$f":"IF('Data Input'!A190=0,\"\",'Data Input'!A190)","v":""},{"$f":"IF(ISBLANK('Data Input'!A190),\"\",COUNTIF('Data Input'!C190:AA190,\"\"))","v":""},{"$f":"IF(ISBLANK('Data Input'!A190),\"\",COUNTIF('Data Input'!C190:AA190,\"0\"))","v":""},{"$f":"IF(ISBLANK('Data Input'!A190),\"\",SUM(B185,C185))","v":""},{"$f":"IF(ISBLANK('Data Input'!A190),\"\",SUM('Data Input'!C190:AA190))","v":""},{"$f":"IF(E185=\"\",\"\",E185/(COUNTA('Data Input'!$C$8:$AA$8)))","v":""},{"$f":"IF(ISBLANK('Data Input'!A190),\"\",SUM('Data Input'!C190,'Data Input'!F190,'Data Input'!G190,'Data Input'!J190,'Data Input'!L190,'Data Input'!O190,'Data Input'!Q190,'Data Input'!R190,'Data Input'!U190))","v":""},{"$f":"IF(G185=\"\",\"\",G185/COUNTIF('Data Input'!$C$8:$AA$8,\"+\"))","v":""},{"$f":"IF(ISBLANK('Data Input'!A190),\"\",SUM('Data Input'!D190,'Data Input'!E190,'Data Input'!K190,'Data Input'!M190,'Data Input'!Y190))","v":""},{"$f":"IF(I185=\"\",\"\",I185/COUNTIF('Data Input'!$C$8:$AA$8,\"-\"))","v":""},{"$f":"IF(ISBLANK('Data Input'!A190),\"\",SUM('Data Input'!H190,'Data Input'!I190,'Data Input'!N190,'Data Input'!S190))","v":""},{"$f":"IF(K185=\"\",\"\",K185/COUNTIF('Data Input'!$C$8:$AA$8,\"x\"))","v":""},{"$f":"IF(ISBLANK('Data Input'!A190),\"\",SUM('Data Input'!P190,'Data Input'!V190,'Data Input'!W190))","v":""},{"$f":"IF(M185=\"\",\"\",M185/COUNTIF('Data Input'!$C$8:$AA$8,\"÷\"))","v":""},{"$f":"IF(ISBLANK('Data Input'!A190),\"\",SUM('Data Input'!T190,'Data Input'!X190,'Data Input'!Z190,'Data Input'!AA190))","v":""},{"$f":"IF(O185=\"\",\"\",O185/COUNTIF('Data Input'!$C$8:$AA$8,\"F\"))","v":""}]
[{"$f":"IF('Data Input'!A191=0,\"\",'Data Input'!A191)","v":""},{"$f":"IF(ISBLANK('Data Input'!A191),\"\",COUNTIF('Data Input'!C191:AA191,\"\"))","v":""},{"$f":"IF(ISBLANK('Data Input'!A191),\"\",COUNTIF('Data Input'!C191:AA191,\"0\"))","v":""},{"$f":"IF(ISBLANK('Data Input'!A191),\"\",SUM(B186,C186))","v":""},{"$f":"IF(ISBLANK('Data Input'!A191),\"\",SUM('Data Input'!C191:AA191))","v":""},{"$f":"IF(E186=\"\",\"\",E186/(COUNTA('Data Input'!$C$8:$AA$8)))","v":""},{"$f":"IF(ISBLANK('Data Input'!A191),\"\",SUM('Data Input'!C191,'Data Input'!F191,'Data Input'!G191,'Data Input'!J191,'Data Input'!L191,'Data Input'!O191,'Data Input'!Q191,'Data Input'!R191,'Data Input'!U191))","v":""},{"$f":"IF(G186=\"\",\"\",G186/COUNTIF('Data Input'!$C$8:$AA$8,\"+\"))","v":""},{"$f":"IF(ISBLANK('Data Input'!A191),\"\",SUM('Data Input'!D191,'Data Input'!E191,'Data Input'!K191,'Data Input'!M191,'Data Input'!Y191))","v":""},{"$f":"IF(I186=\"\",\"\",I186/COUNTIF('Data Input'!$C$8:$AA$8,\"-\"))","v":""},{"$f":"IF(ISBLANK('Data Input'!A191),\"\",SUM('Data Input'!H191,'Data Input'!I191,'Data Input'!N191,'Data Input'!S191))","v":""},{"$f":"IF(K186=\"\",\"\",K186/COUNTIF('Data Input'!$C$8:$AA$8,\"x\"))","v":""},{"$f":"IF(ISBLANK('Data Input'!A191),\"\",SUM('Data Input'!P191,'Data Input'!V191,'Data Input'!W191))","v":""},{"$f":"IF(M186=\"\",\"\",M186/COUNTIF('Data Input'!$C$8:$AA$8,\"÷\"))","v":""},{"$f":"IF(ISBLANK('Data Input'!A191),\"\",SUM('Data Input'!T191,'Data Input'!X191,'Data Input'!Z191,'Data Input'!AA191))","v":""},{"$f":"IF(O186=\"\",\"\",O186/COUNTIF('Data Input'!$C$8:$AA$8,\"F\"))","v":""}]
[{"$f":"IF('Data Input'!A192=0,\"\",'Data Input'!A192)","v":""},{"$f":"IF(ISBLANK('Data Input'!A192),\"\",COUNTIF('Data Input'!C192:AA192,\"\"))","v":""},{"$f":"IF(ISBLANK('Data Input'!A192),\"\",COUNTIF('Data Input'!C192:AA192,\"0\"))","v":""},{"$f":"IF(ISBLANK('Data Input'!A192),\"\",SUM(B187,C187))","v":""},{"$f":"IF(ISBLANK('Data Input'!A192),\"\",SUM('Data Input'!C192:AA192))","v":""},{"$f":"IF(E187=\"\",\"\",E187/(COUNTA('Data Input'!$C$8:$AA$8)))","v":""},{"$f":"IF(ISBLANK('Data Input'!A192),\"\",SUM('Data Input'!C192,'Data Input'!F192,'Data Input'!G192,'Data Input'!J192,'Data Input'!L192,'Data Input'!O192,'Data Input'!Q192,'Data Input'!R192,'Data Input'!U192))","v":""},{"$f":"IF(G187=\"\",\"\",G187/COUNTIF('Data Input'!$C$8:$AA$8,\"+\"))","v":""},{"$f":"IF(ISBLANK('Data Input'!A192),\"\",SUM('Data Input'!D192,'Data Input'!E192,'Data Input'!K192,'Data Input'!M192,'Data Input'!Y192))","v":""},{"$f":"IF(I187=\"\",\"\",I187/COUNTIF('Data Input'!$C$8:$AA$8,\"-\"))","v":""},{"$f":"IF(ISBLANK('Data Input'!A192),\"\",SUM('Data Input'!H192,'Data Input'!I192,'Data Input'!N192,'Data Input'!S192))","v":""},{"$f":"IF(K187=\"\",\"\",K187/COUNTIF('Data Input'!$C$8:$AA$8,\"x\"))","v":""},{"$f":"IF(ISBLANK('Data Input'!A192),\"\",SUM('Data Input'!P192,'Data Input'!V192,'Data Input'!W192))","v":""},{"$f":"IF(M187=\"\",\"\",M187/COUNTIF('Data Input'!$C$8:$AA$8,\"÷\"))","v":""},{"$f":"IF(ISBLANK('Data Input'!A192),\"\",SUM('Data Input'!T192,'Data Input'!X192,'Data Input'!Z192,'Data Input'!AA192))","v":""},{"$f":"IF(O187=\"\",\"\",O187/COUNTIF('Data Input'!$C$8:$AA$8,\"F\"))","v":""}]
[{"$f":"IF('Data Input'!A193=0,\"\",'Data Input'!A193)","v":""},{"$f":"IF(ISBLANK('Data Input'!A193),\"\",COUNTIF('Data Input'!C193:AA193,\"\"))","v":""},{"$f":"IF(ISBLANK('Data Input'!A193),\"\",COUNTIF('Data Input'!C193:AA193,\"0\"))","v":""},{"$f":"IF(ISBLANK('Data Input'!A193),\"\",SUM(B188,C188))","v":""},{"$f":"IF(ISBLANK('Data Input'!A193),\"\",SUM('Data Input'!C193:AA193))","v":""},{"$f":"IF(E188=\"\",\"\",E188/(COUNTA('Data Input'!$C$8:$AA$8)))","v":""},{"$f":"IF(ISBLANK('Data Input'!A193),\"\",SUM('Data Input'!C193,'Data Input'!F193,'Data Input'!G193,'Data Input'!J193,'Data Input'!L193,'Data Input'!O193,'Data Input'!Q193,'Data Input'!R193,'Data Input'!U193))","v":""},{"$f":"IF(G188=\"\",\"\",G188/COUNTIF('Data Input'!$C$8:$AA$8,\"+\"))","v":""},{"$f":"IF(ISBLANK('Data Input'!A193),\"\",SUM('Data Input'!D193,'Data Input'!E193,'Data Input'!K193,'Data Input'!M193,'Data Input'!Y193))","v":""},{"$f":"IF(I188=\"\",\"\",I188/COUNTIF('Data Input'!$C$8:$AA$8,\"-\"))","v":""},{"$f":"IF(ISBLANK('Data Input'!A193),\"\",SUM('Data Input'!H193,'Data Input'!I193,'Data Input'!N193,'Data Input'!S193))","v":""},{"$f":"IF(K188=\"\",\"\",K188/COUNTIF('Data Input'!$C$8:$AA$8,\"x\"))","v":""},{"$f":"IF(ISBLANK('Data Input'!A193),\"\",SUM('Data Input'!P193,'Data Input'!V193,'Data Input'!W193))","v":""},{"$f":"IF(M188=\"\",\"\",M188/COUNTIF('Data Input'!$C$8:$AA$8,\"÷\"))","v":""},{"$f":"IF(ISBLANK('Data Input'!A193),\"\",SUM('Data Input'!T193,'Data Input'!X193,'Data Input'!Z193,'Data Input'!AA193))","v":""},{"$f":"IF(O188=\"\",\"\",O188/COUNTIF('Data Input'!$C$8:$AA$8,\"F\"))","v":""}]
[{"$f":"IF('Data Input'!A194=0,\"\",'Data Input'!A194)","v":""},{"$f":"IF(ISBLANK('Data Input'!A194),\"\",COUNTIF('Data Input'!C194:AA194,\"\"))","v":""},{"$f":"IF(ISBLANK('Data Input'!A194),\"\",COUNTIF('Data Input'!C194:AA194,\"0\"))","v":""},{"$f":"IF(ISBLANK('Data Input'!A194),\"\",SUM(B189,C189))","v":""},{"$f":"IF(ISBLANK('Data Input'!A194),\"\",SUM('Data Input'!C194:AA194))","v":""},{"$f":"IF(E189=\"\",\"\",E189/(COUNTA('Data Input'!$C$8:$AA$8)))","v":""},{"$f":"IF(ISBLANK('Data Input'!A194),\"\",SUM('Data Input'!C194,'Data Input'!F194,'Data Input'!G194,'Data Input'!J194,'Data Input'!L194,'Data Input'!O194,'Data Input'!Q194,'Data Input'!R194,'Data Input'!U194))","v":""},{"$f":"IF(G189=\"\",\"\",G189/COUNTIF('Data Input'!$C$8:$AA$8,\"+\"))","v":""},{"$f":"IF(ISBLANK('Data Input'!A194),\"\",SUM('Data Input'!D194,'Data Input'!E194,'Data Input'!K194,'Data Input'!M194,'Data Input'!Y194))","v":""},{"$f":"IF(I189=\"\",\"\",I189/COUNTIF('Data Input'!$C$8:$AA$8,\"-\"))","v":""},{"$f":"IF(ISBLANK('Data Input'!A194),\"\",SUM('Data Input'!H194,'Data Input'!I194,'Data Input'!N194,'Data Input'!S194))","v":""},{"$f":"IF(K189=\"\",\"\",K189/COUNTIF('Data Input'!$C$8:$AA$8,\"x\"))","v":""},{"$f":"IF(ISBLANK('Data Input'!A194),\"\",SUM('Data Input'!P194,'Data Input'!V194,'Data Input'!W194))","v":""},{"$f":"IF(M189=\"\",\"\",M189/COUNTIF('Data Input'!$C$8:$AA$8,\"÷\"))","v":""},{"$f":"IF(ISBLANK('Data Input'!A194),\"\",SUM('Data Input'!T194,'Data Input'!X194,'Data Input'!Z194,'Data Input'!AA194))","v":""},{"$f":"IF(O189=\"\",\"\",O189/COUNTIF('Data Input'!$C$8:$AA$8,\"F\"))","v":""}]
[{"$f":"IF('Data Input'!A195=0,\"\",'Data Input'!A195)","v":""},{"$f":"IF(ISBLANK('Data Input'!A195),\"\",COUNTIF('Data Input'!C195:AA195,\"\"))","v":""},{"$f":"IF(ISBLANK('Data Input'!A195),\"\",COUNTIF('Data Input'!C195:AA195,\"0\"))","v":""},{"$f":"IF(ISBLANK('Data Input'!A195),\"\",SUM(B190,C190))","v":""},{"$f":"IF(ISBLANK('Data Input'!A195),\"\",SUM('Data Input'!C195:AA195))","v":""},{"$f":"IF(E190=\"\",\"\",E190/(COUNTA('Data Input'!$C$8:$AA$8)))","v":""},{"$f":"IF(ISBLANK('Data Input'!A195),\"\",SUM('Data Input'!C195,'Data Input'!F195,'Data Input'!G195,'Data Input'!J195,'Data Input'!L195,'Data Input'!O195,'Data Input'!Q195,'Data Input'!R195,'Data Input'!U195))","v":""},{"$f":"IF(G190=\"\",\"\",G190/COUNTIF('Data Input'!$C$8:$AA$8,\"+\"))","v":""},{"$f":"IF(ISBLANK('Data Input'!A195),\"\",SUM('Data Input'!D195,'Data Input'!E195,'Data Input'!K195,'Data Input'!M195,'Data Input'!Y195))","v":""},{"$f":"IF(I190=\"\",\"\",I190/COUNTIF('Data Input'!$C$8:$AA$8,\"-\"))","v":""},{"$f":"IF(ISBLANK('Data Input'!A195),\"\",SUM('Data Input'!H195,'Data Input'!I195,'Data Input'!N195,'Data Input'!S195))","v":""},{"$f":"IF(K190=\"\",\"\",K190/COUNTIF('Data Input'!$C$8:$AA$8,\"x\"))","v":""},{"$f":"IF(ISBLANK('Data Input'!A195),\"\",SUM('Data Input'!P195,'Data Input'!V195,'Data Input'!W195))","v":""},{"$f":"IF(M190=\"\",\"\",M190/COUNTIF('Data Input'!$C$8:$AA$8,\"÷\"))","v":""},{"$f":"IF(ISBLANK('Data Input'!A195),\"\",SUM('Data Input'!T195,'Data Input'!X195,'Data Input'!Z195,'Data Input'!AA195))","v":""},{"$f":"IF(O190=\"\",\"\",O190/COUNTIF('Data Input'!$C$8:$AA$8,\"F\"))","v":""}]
[{"$f":"IF('Data Input'!A196=0,\"\",'Data Input'!A196)","v":""},{"$f":"IF(ISBLANK('Data Input'!A196),\"\",COUNTIF('Data Input'!C196:AA196,\"\"))","v":""},{"$f":"IF(ISBLANK('Data Input'!A196),\"\",COUNTIF('Data Input'!C196:AA196,\"0\"))","v":""},{"$f":"IF(ISBLANK('Data Input'!A196),\"\",SUM(B191,C191))","v":""},{"$f":"IF(ISBLANK('Data Input'!A196),\"\",SUM('Data Input'!C196:AA196))","v":""},{"$f":"IF(E191=\"\",\"\",E191/(COUNTA('Data Input'!$C$8:$AA$8)))","v":""},{"$f":"IF(ISBLANK('Data Input'!A196),\"\",SUM('Data Input'!C196,'Data Input'!F196,'Data Input'!G196,'Data Input'!J196,'Data Input'!L196,'Data Input'!O196,'Data Input'!Q196,'Data Input'!R196,'Data Input'!U196))","v":""},{"$f":"IF(G191=\"\",\"\",G191/COUNTIF('Data Input'!$C$8:$AA$8,\"+\"))","v":""},{"$f":"IF(ISBLANK('Data Input'!A196),\"\",SUM('Data Input'!D196,'Data Input'!E196,'Data Input'!K196,'Data Input'!M196,'Data Input'!Y196))","v":""},{"$f":"IF(I191=\"\",\"\",I191/COUNTIF('Data Input'!$C$8:$AA$8,\"-\"))","v":""},{"$f":"IF(ISBLANK('Data Input'!A196),\"\",SUM('Data Input'!H196,'Data Input'!I196,'Data Input'!N196,'Data Input'!S196))","v":""},{"$f":"IF(K191=\"\",\"\",K191/COUNTIF('Data Input'!$C$8:$AA$8,\"x\"))","v":""},{"$f":"IF(ISBLANK('Data Input'!A196),\"\",SUM('Data Input'!P196,'Data Input'!V196,'Data Input'!W196))","v":""},{"$f":"IF(M191=\"\",\"\",M191/COUNTIF('Data Input'!$C$8:$AA$8,\"÷\"))","v":""},{"$f":"IF(ISBLANK('Data Input'!A196),\"\",SUM('Data Input'!T196,'Data Input'!X196,'Data Input'!Z196,'Data Input'!AA196))","v":""},{"$f":"IF(O191=\"\",\"\",O191/COUNTIF('Data Input'!$C$8:$AA$8,\"F\"))","v":""}]
[{"$f":"IF('Data Input'!A197=0,\"\",'Data Input'!A197)","v":""},{"$f":"IF(ISBLANK('Data Input'!A197),\"\",COUNTIF('Data Input'!C197:AA197,\"\"))","v":""},{"$f":"IF(ISBLANK('Data Input'!A197),\"\",COUNTIF('Data Input'!C197:AA197,\"0\"))","v":""},{"$f":"IF(ISBLANK('Data Input'!A197),\"\",SUM(B192,C192))","v":""},{"$f":"IF(ISBLANK('Data Input'!A197),\"\",SUM('Data Input'!C197:AA197))","v":""},{"$f":"IF(E192=\"\",\"\",E192/(COUNTA('Data Input'!$C$8:$AA$8)))","v":""},{"$f":"IF(ISBLANK('Data Input'!A197),\"\",SUM('Data Input'!C197,'Data Input'!F197,'Data Input'!G197,'Data Input'!J197,'Data Input'!L197,'Data Input'!O197,'Data Input'!Q197,'Data Input'!R197,'Data Input'!U197))","v":""},{"$f":"IF(G192=\"\",\"\",G192/COUNTIF('Data Input'!$C$8:$AA$8,\"+\"))","v":""},{"$f":"IF(ISBLANK('Data Input'!A197),\"\",SUM('Data Input'!D197,'Data Input'!E197,'Data Input'!K197,'Data Input'!M197,'Data Input'!Y197))","v":""},{"$f":"IF(I192=\"\",\"\",I192/COUNTIF('Data Input'!$C$8:$AA$8,\"-\"))","v":""},{"$f":"IF(ISBLANK('Data Input'!A197),\"\",SUM('Data Input'!H197,'Data Input'!I197,'Data Input'!N197,'Data Input'!S197))","v":""},{"$f":"IF(K192=\"\",\"\",K192/COUNTIF('Data Input'!$C$8:$AA$8,\"x\"))","v":""},{"$f":"IF(ISBLANK('Data Input'!A197),\"\",SUM('Data Input'!P197,'Data Input'!V197,'Data Input'!W197))","v":""},{"$f":"IF(M192=\"\",\"\",M192/COUNTIF('Data Input'!$C$8:$AA$8,\"÷\"))","v":""},{"$f":"IF(ISBLANK('Data Input'!A197),\"\",SUM('Data Input'!T197,'Data Input'!X197,'Data Input'!Z197,'Data Input'!AA197))","v":""},{"$f":"IF(O192=\"\",\"\",O192/COUNTIF('Data Input'!$C$8:$AA$8,\"F\"))","v":""}]
[{"$f":"IF('Data Input'!A198=0,\"\",'Data Input'!A198)","v":""},{"$f":"IF(ISBLANK('Data Input'!A198),\"\",COUNTIF('Data Input'!C198:AA198,\"\"))","v":""},{"$f":"IF(ISBLANK('Data Input'!A198),\"\",COUNTIF('Data Input'!C198:AA198,\"0\"))","v":""},{"$f":"IF(ISBLANK('Data Input'!A198),\"\",SUM(B193,C193))","v":""},{"$f":"IF(ISBLANK('Data Input'!A198),\"\",SUM('Data Input'!C198:AA198))","v":""},{"$f":"IF(E193=\"\",\"\",E193/(COUNTA('Data Input'!$C$8:$AA$8)))","v":""},{"$f":"IF(ISBLANK('Data Input'!A198),\"\",SUM('Data Input'!C198,'Data Input'!F198,'Data Input'!G198,'Data Input'!J198,'Data Input'!L198,'Data Input'!O198,'Data Input'!Q198,'Data Input'!R198,'Data Input'!U198))","v":""},{"$f":"IF(G193=\"\",\"\",G193/COUNTIF('Data Input'!$C$8:$AA$8,\"+\"))","v":""},{"$f":"IF(ISBLANK('Data Input'!A198),\"\",SUM('Data Input'!D198,'Data Input'!E198,'Data Input'!K198,'Data Input'!M198,'Data Input'!Y198))","v":""},{"$f":"IF(I193=\"\",\"\",I193/COUNTIF('Data Input'!$C$8:$AA$8,\"-\"))","v":""},{"$f":"IF(ISBLANK('Data Input'!A198),\"\",SUM('Data Input'!H198,'Data Input'!I198,'Data Input'!N198,'Data Input'!S198))","v":""},{"$f":"IF(K193=\"\",\"\",K193/COUNTIF('Data Input'!$C$8:$AA$8,\"x\"))","v":""},{"$f":"IF(ISBLANK('Data Input'!A198),\"\",SUM('Data Input'!P198,'Data Input'!V198,'Data Input'!W198))","v":""},{"$f":"IF(M193=\"\",\"\",M193/COUNTIF('Data Input'!$C$8:$AA$8,\"÷\"))","v":""},{"$f":"IF(ISBLANK('Data Input'!A198),\"\",SUM('Data Input'!T198,'Data Input'!X198,'Data Input'!Z198,'Data Input'!AA198))","v":""},{"$f":"IF(O193=\"\",\"\",O193/COUNTIF('Data Input'!$C$8:$AA$8,\"F\"))","v":""}]
[{"$f":"IF('Data Input'!A199=0,\"\",'Data Input'!A199)","v":""},{"$f":"IF(ISBLANK('Data Input'!A199),\"\",COUNTIF('Data Input'!C199:AA199,\"\"))","v":""},{"$f":"IF(ISBLANK('Data Input'!A199),\"\",COUNTIF('Data Input'!C199:AA199,\"0\"))","v":""},{"$f":"IF(ISBLANK('Data Input'!A199),\"\",SUM(B194,C194))","v":""},{"$f":"IF(ISBLANK('Data Input'!A199),\"\",SUM('Data Input'!C199:AA199))","v":""},{"$f":"IF(E194=\"\",\"\",E194/(COUNTA('Data Input'!$C$8:$AA$8)))","v":""},{"$f":"IF(ISBLANK('Data Input'!A199),\"\",SUM('Data Input'!C199,'Data Input'!F199,'Data Input'!G199,'Data Input'!J199,'Data Input'!L199,'Data Input'!O199,'Data Input'!Q199,'Data Input'!R199,'Data Input'!U199))","v":""},{"$f":"IF(G194=\"\",\"\",G194/COUNTIF('Data Input'!$C$8:$AA$8,\"+\"))","v":""},{"$f":"IF(ISBLANK('Data Input'!A199),\"\",SUM('Data Input'!D199,'Data Input'!E199,'Data Input'!K199,'Data Input'!M199,'Data Input'!Y199))","v":""},{"$f":"IF(I194=\"\",\"\",I194/COUNTIF('Data Input'!$C$8:$AA$8,\"-\"))","v":""},{"$f":"IF(ISBLANK('Data Input'!A199),\"\",SUM('Data Input'!H199,'Data Input'!I199,'Data Input'!N199,'Data Input'!S199))","v":""},{"$f":"IF(K194=\"\",\"\",K194/COUNTIF('Data Input'!$C$8:$AA$8,\"x\"))","v":""},{"$f":"IF(ISBLANK('Data Input'!A199),\"\",SUM('Data Input'!P199,'Data Input'!V199,'Data Input'!W199))","v":""},{"$f":"IF(M194=\"\",\"\",M194/COUNTIF('Data Input'!$C$8:$AA$8,\"÷\"))","v":""},{"$f":"IF(ISBLANK('Data Input'!A199),\"\",SUM('Data Input'!T199,'Data Input'!X199,'Data Input'!Z199,'Data Input'!AA199))","v":""},{"$f":"IF(O194=\"\",\"\",O194/COUNTIF('Data Input'!$C$8:$AA$8,\"F\"))","v":""}]
[{"$f":"IF('Data Input'!A200=0,\"\",'Data Input'!A200)","v":""},{"$f":"IF(ISBLANK('Data Input'!A200),\"\",COUNTIF('Data Input'!C200:AA200,\"\"))","v":""},{"$f":"IF(ISBLANK('Data Input'!A200),\"\",COUNTIF('Data Input'!C200:AA200,\"0\"))","v":""},{"$f":"IF(ISBLANK('Data Input'!A200),\"\",SUM(B195,C195))","v":""},{"$f":"IF(ISBLANK('Data Input'!A200),\"\",SUM('Data Input'!C200:AA200))","v":""},{"$f":"IF(E195=\"\",\"\",E195/(COUNTA('Data Input'!$C$8:$AA$8)))","v":""},{"$f":"IF(ISBLANK('Data Input'!A200),\"\",SUM('Data Input'!C200,'Data Input'!F200,'Data Input'!G200,'Data Input'!J200,'Data Input'!L200,'Data Input'!O200,'Data Input'!Q200,'Data Input'!R200,'Data Input'!U200))","v":""},{"$f":"IF(G195=\"\",\"\",G195/COUNTIF('Data Input'!$C$8:$AA$8,\"+\"))","v":""},{"$f":"IF(ISBLANK('Data Input'!A200),\"\",SUM('Data Input'!D200,'Data Input'!E200,'Data Input'!K200,'Data Input'!M200,'Data Input'!Y200))","v":""},{"$f":"IF(I195=\"\",\"\",I195/COUNTIF('Data Input'!$C$8:$AA$8,\"-\"))","v":""},{"$f":"IF(ISBLANK('Data Input'!A200),\"\",SUM('Data Input'!H200,'Data Input'!I200,'Data Input'!N200,'Data Input'!S200))","v":""},{"$f":"IF(K195=\"\",\"\",K195/COUNTIF('Data Input'!$C$8:$AA$8,\"x\"))","v":""},{"$f":"IF(ISBLANK('Data Input'!A200),\"\",SUM('Data Input'!P200,'Data Input'!V200,'Data Input'!W200))","v":""},{"$f":"IF(M195=\"\",\"\",M195/COUNTIF('Data Input'!$C$8:$AA$8,\"÷\"))","v":""},{"$f":"IF(ISBLANK('Data Input'!A200),\"\",SUM('Data Input'!T200,'Data Input'!X200,'Data Input'!Z200,'Data Input'!AA200))","v":""},{"$f":"IF(O195=\"\",\"\",O195/COUNTIF('Data Input'!$C$8:$AA$8,\"F\"))","v":""}]
[{"$f":"IF('Data Input'!A201=0,\"\",'Data Input'!A201)","v":""},{"$f":"IF(ISBLANK('Data Input'!A201),\"\",COUNTIF('Data Input'!C201:AA201,\"\"))","v":""},{"$f":"IF(ISBLANK('Data Input'!A201),\"\",COUNTIF('Data Input'!C201:AA201,\"0\"))","v":""},{"$f":"IF(ISBLANK('Data Input'!A201),\"\",SUM(B196,C196))","v":""},{"$f":"IF(ISBLANK('Data Input'!A201),\"\",SUM('Data Input'!C201:AA201))","v":""},{"$f":"IF(E196=\"\",\"\",E196/(COUNTA('Data Input'!$C$8:$AA$8)))","v":""},{"$f":"IF(ISBLANK('Data Input'!A201),\"\",SUM('Data Input'!C201,'Data Input'!F201,'Data Input'!G201,'Data Input'!J201,'Data Input'!L201,'Data Input'!O201,'Data Input'!Q201,'Data Input'!R201,'Data Input'!U201))","v":""},{"$f":"IF(G196=\"\",\"\",G196/COUNTIF('Data Input'!$C$8:$AA$8,\"+\"))","v":""},{"$f":"IF(ISBLANK('Data Input'!A201),\"\",SUM('Data Input'!D201,'Data Input'!E201,'Data Input'!K201,'Data Input'!M201,'Data Input'!Y201))","v":""},{"$f":"IF(I196=\"\",\"\",I196/COUNTIF('Data Input'!$C$8:$AA$8,\"-\"))","v":""},{"$f":"IF(ISBLANK('Data Input'!A201),\"\",SUM('Data Input'!H201,'Data Input'!I201,'Data Input'!N201,'Data Input'!S201))","v":""},{"$f":"IF(K196=\"\",\"\",K196/COUNTIF('Data Input'!$C$8:$AA$8,\"x\"))","v":""},{"$f":"IF(ISBLANK('Data Input'!A201),\"\",SUM('Data Input'!P201,'Data Input'!V201,'Data Input'!W201))","v":""},{"$f":"IF(M196=\"\",\"\",M196/COUNTIF('Data Input'!$C$8:$AA$8,\"÷\"))","v":""},{"$f":"IF(ISBLANK('Data Input'!A201),\"\",SUM('Data Input'!T201,'Data Input'!X201,'Data Input'!Z201,'Data Input'!AA201))","v":""},{"$f":"IF(O196=\"\",\"\",O196/COUNTIF('Data Input'!$C$8:$AA$8,\"F\"))","v":""}]
[{"$f":"IF('Data Input'!A202=0,\"\",'Data Input'!A202)","v":""},{"$f":"IF(ISBLANK('Data Input'!A202),\"\",COUNTIF('Data Input'!C202:AA202,\"\"))","v":""},{"$f":"IF(ISBLANK('Data Input'!A202),\"\",COUNTIF('Data Input'!C202:AA202,\"0\"))","v":""},{"$f":"IF(ISBLANK('Data Input'!A202),\"\",SUM(B197,C197))","v":""},{"$f":"IF(ISBLANK('Data Input'!A202),\"\",SUM('Data Input'!C202:AA202))","v":""},{"$f":"IF(E197=\"\",\"\",E197/(COUNTA('Data Input'!$C$8:$AA$8)))","v":""},{"$f":"IF(ISBLANK('Data Input'!A202),\"\",SUM('Data Input'!C202,'Data Input'!F202,'Data Input'!G202,'Data Input'!J202,'Data Input'!L202,'Data Input'!O202,'Data Input'!Q202,'Data Input'!R202,'Data Input'!U202))","v":""},{"$f":"IF(G197=\"\",\"\",G197/COUNTIF('Data Input'!$C$8:$AA$8,\"+\"))","v":""},{"$f":"IF(ISBLANK('Data Input'!A202),\"\",SUM('Data Input'!D202,'Data Input'!E202,'Data Input'!K202,'Data Input'!M202,'Data Input'!Y202))","v":""},{"$f":"IF(I197=\"\",\"\",I197/COUNTIF('Data Input'!$C$8:$AA$8,\"-\"))","v":""},{"$f":"IF(ISBLANK('Data Input'!A202),\"\",SUM('Data Input'!H202,'Data Input'!I202,'Data Input'!N202,'Data Input'!S202))","v":""},{"$f":"IF(K197=\"\",\"\",K197/COUNTIF('Data Input'!$C$8:$AA$8,\"x\"))","v":""},{"$f":"IF(ISBLANK('Data Input'!A202),\"\",SUM('Data Input'!P202,'Data Input'!V202,'Data Input'!W202))","v":""},{"$f":"IF(M197=\"\",\"\",M197/COUNTIF('Data Input'!$C$8:$AA$8,\"÷\"))","v":""},{"$f":"IF(ISBLANK('Data Input'!A202),\"\",SUM('Data Input'!T202,'Data Input'!X202,'Data Input'!Z202,'Data Input'!AA202))","v":""},{"$f":"IF(O197=\"\",\"\",O197/COUNTIF('Data Input'!$C$8:$AA$8,\"F\"))","v":""}]
[{"$f":"IF('Data Input'!A203=0,\"\",'Data Input'!A203)","v":""},{"$f":"IF(ISBLANK('Data Input'!A203),\"\",COUNTIF('Data Input'!C203:AA203,\"\"))","v":""},{"$f":"IF(ISBLANK('Data Input'!A203),\"\",COUNTIF('Data Input'!C203:AA203,\"0\"))","v":""},{"$f":"IF(ISBLANK('Data Input'!A203),\"\",SUM(B198,C198))","v":""},{"$f":"IF(ISBLANK('Data Input'!A203),\"\",SUM('Data Input'!C203:AA203))","v":""},{"$f":"IF(E198=\"\",\"\",E198/(COUNTA('Data Input'!$C$8:$AA$8)))","v":""},{"$f":"IF(ISBLANK('Data Input'!A203),\"\",SUM('Data Input'!C203,'Data Input'!F203,'Data Input'!G203,'Data Input'!J203,'Data Input'!L203,'Data Input'!O203,'Data Input'!Q203,'Data Input'!R203,'Data Input'!U203))","v":""},{"$f":"IF(G198=\"\",\"\",G198/COUNTIF('Data Input'!$C$8:$AA$8,\"+\"))","v":""},{"$f":"IF(ISBLANK('Data Input'!A203),\"\",SUM('Data Input'!D203,'Data Input'!E203,'Data Input'!K203,'Data Input'!M203,'Data Input'!Y203))","v":""},{"$f":"IF(I198=\"\",\"\",I198/COUNTIF('Data Input'!$C$8:$AA$8,\"-\"))","v":""},{"$f":"IF(ISBLANK('Data Input'!A203),\"\",SUM('Data Input'!H203,'Data Input'!I203,'Data Input'!N203,'Data Input'!S203))","v":""},{"$f":"IF(K198=\"\",\"\",K198/COUNTIF('Data Input'!$C$8:$AA$8,\"x\"))","v":""},{"$f":"IF(ISBLANK('Data Input'!A203),\"\",SUM('Data Input'!P203,'Data Input'!V203,'Data Input'!W203))","v":""},{"$f":"IF(M198=\"\",\"\",M198/COUNTIF('Data Input'!$C$8:$AA$8,\"÷\"))","v":""},{"$f":"IF(ISBLANK('Data Input'!A203),\"\",SUM('Data Input'!T203,'Data Input'!X203,'Data Input'!Z203,'Data Input'!AA203))","v":""},{"$f":"IF(O198=\"\",\"\",O198/COUNTIF('Data Input'!$C$8:$AA$8,\"F\"))","v":""}]
[{"$f":"IF('Data Input'!A204=0,\"\",'Data Input'!A204)","v":""},{"$f":"IF(ISBLANK('Data Input'!A204),\"\",COUNTIF('Data Input'!C204:AA204,\"\"))","v":""},{"$f":"IF(ISBLANK('Data Input'!A204),\"\",COUNTIF('Data Input'!C204:AA204,\"0\"))","v":""},{"$f":"IF(ISBLANK('Data Input'!A204),\"\",SUM(B199,C199))","v":""},{"$f":"IF(ISBLANK('Data Input'!A204),\"\",SUM('Data Input'!C204:AA204))","v":""},{"$f":"IF(E199=\"\",\"\",E199/(COUNTA('Data Input'!$C$8:$AA$8)))","v":""},{"$f":"IF(ISBLANK('Data Input'!A204),\"\",SUM('Data Input'!C204,'Data Input'!F204,'Data Input'!G204,'Data Input'!J204,'Data Input'!L204,'Data Input'!O204,'Data Input'!Q204,'Data Input'!R204,'Data Input'!U204))","v":""},{"$f":"IF(G199=\"\",\"\",G199/COUNTIF('Data Input'!$C$8:$AA$8,\"+\"))","v":""},{"$f":"IF(ISBLANK('Data Input'!A204),\"\",SUM('Data Input'!D204,'Data Input'!E204,'Data Input'!K204,'Data Input'!M204,'Data Input'!Y204))","v":""},{"$f":"IF(I199=\"\",\"\",I199/COUNTIF('Data Input'!$C$8:$AA$8,\"-\"))","v":""},{"$f":"IF(ISBLANK('Data Input'!A204),\"\",SUM('Data Input'!H204,'Data Input'!I204,'Data Input'!N204,'Data Input'!S204))","v":""},{"$f":"IF(K199=\"\",\"\",K199/COUNTIF('Data Input'!$C$8:$AA$8,\"x\"))","v":""},{"$f":"IF(ISBLANK('Data Input'!A204),\"\",SUM('Data Input'!P204,'Data Input'!V204,'Data Input'!W204))","v":""},{"$f":"IF(M199=\"\",\"\",M199/COUNTIF('Data Input'!$C$8:$AA$8,\"÷\"))","v":""},{"$f":"IF(ISBLANK('Data Input'!A204),\"\",SUM('Data Input'!T204,'Data Input'!X204,'Data Input'!Z204,'Data Input'!AA204))","v":""},{"$f":"IF(O199=\"\",\"\",O199/COUNTIF('Data Input'!$C$8:$AA$8,\"F\"))","v":""}]
[{"$f":"IF('Data Input'!A205=0,\"\",'Data Input'!A205)","v":""},{"$f":"IF(ISBLANK('Data Input'!A205),\"\",COUNTIF('Data Input'!C205:AA205,\"\"))","v":""},{"$f":"IF(ISBLANK('Data Input'!A205),\"\",COUNTIF('Data Input'!C205:AA205,\"0\"))","v":""},{"$f":"IF(ISBLANK('Data Input'!A205),\"\",SUM(B200,C200))","v":""},{"$f":"IF(ISBLANK('Data Input'!A205),\"\",SUM('Data Input'!C205:AA205))","v":""},{"$f":"IF(E200=\"\",\"\",E200/(COUNTA('Data Input'!$C$8:$AA$8)))","v":""},{"$f":"IF(ISBLANK('Data Input'!A205),\"\",SUM('Data Input'!C205,'Data Input'!F205,'Data Input'!G205,'Data Input'!J205,'Data Input'!L205,'Data Input'!O205,'Data Input'!Q205,'Data Input'!R205,'Data Input'!U205))","v":""},{"$f":"IF(G200=\"\",\"\",G200/COUNTIF('Data Input'!$C$8:$AA$8,\"+\"))","v":""},{"$f":"IF(ISBLANK('Data Input'!A205),\"\",SUM('Data Input'!D205,'Data Input'!E205,'Data Input'!K205,'Data Input'!M205,'Data Input'!Y205))","v":""},{"$f":"IF(I200=\"\",\"\",I200/COUNTIF('Data Input'!$C$8:$AA$8,\"-\"))","v":""},{"$f":"IF(ISBLANK('Data Input'!A205),\"\",SUM('Data Input'!H205,'Data Input'!I205,'Data Input'!N205,'Data Input'!S205))","v":""},{"$f":"IF(K200=\"\",\"\",K200/COUNTIF('Data Input'!$C$8:$AA$8,\"x\"))","v":""},{"$f":"IF(ISBLANK('Data Input'!A205),\"\",SUM('Data Input'!P205,'Data Input'!V205,'Data Input'!W205))","v":""},{"$f":"IF(M200=\"\",\"\",M200/COUNTIF('Data Input'!$C$8:$AA$8,\"÷\"))","v":""},{"$f":"IF(ISBLANK('Data Input'!A205),\"\",SUM('Data Input'!T205,'Data Input'!X205,'Data Input'!Z205,'Data Input'!AA205))","v":""},{"$f":"IF(O200=\"\",\"\",O200/COUNTIF('Data Input'!$C$8:$AA$8,\"F\"))","v":""}]
[{"$f":"IF('Data Input'!A206=0,\"\",'Data Input'!A206)","v":""},{"$f":"IF(ISBLANK('Data Input'!A206),\"\",COUNTIF('Data Input'!C206:AA206,\"\"))","v":""},{"$f":"IF(ISBLANK('Data Input'!A206),\"\",COUNTIF('Data Input'!C206:AA206,\"0\"))","v":""},{"$f":"IF(ISBLANK('Data Input'!A206),\"\",SUM(B201,C201))","v":""},{"$f":"IF(ISBLANK('Data Input'!A206),\"\",SUM('Data Input'!C206:AA206))","v":""},{"$f":"IF(E201=\"\",\"\",E201/(COUNTA('Data Input'!$C$8:$AA$8)))","v":""},{"$f":"IF(ISBLANK('Data Input'!A206),\"\",SUM('Data Input'!C206,'Data Input'!F206,'Data Input'!G206,'Data Input'!J206,'Data Input'!L206,'Data Input'!O206,'Data Input'!Q206,'Data Input'!R206,'Data Input'!U206))","v":""},{"$f":"IF(G201=\"\",\"\",G201/COUNTIF('Data Input'!$C$8:$AA$8,\"+\"))","v":""},{"$f":"IF(ISBLANK('Data Input'!A206),\"\",SUM('Data Input'!D206,'Data Input'!E206,'Data Input'!K206,'Data Input'!M206,'Data Input'!Y206))","v":""},{"$f":"IF(I201=\"\",\"\",I201/COUNTIF('Data Input'!$C$8:$AA$8,\"-\"))","v":""},{"$f":"IF(ISBLANK('Data Input'!A206),\"\",SUM('Data Input'!H206,'Data Input'!I206,'Data Input'!N206,'Data Input'!S206))","v":""},{"$f":"IF(K201=\"\",\"\",K201/COUNTIF('Data Input'!$C$8:$AA$8,\"x\"))","v":""},{"$f":"IF(ISBLANK('Data Input'!A206),\"\",SUM('Data Input'!P206,'Data Input'!V206,'Data Input'!W206))","v":""},{"$f":"IF(M201=\"\",\"\",M201/COUNTIF('Data Input'!$C$8:$AA$8,\"÷\"))","v":""},{"$f":"IF(ISBLANK('Data Input'!A206),\"\",SUM('Data Input'!T206,'Data Input'!X206,'Data Input'!Z206,'Data Input'!AA206))","v":""},{"$f":"IF(O201=\"\",\"\",O201/COUNTIF('Data Input'!$C$8:$AA$8,\"F\"))","v":""}]
[{"$f":"IF('Data Input'!A207=0,\"\",'Data Input'!A207)","v":""},{"$f":"IF(ISBLANK('Data Input'!A207),\"\",COUNTIF('Data Input'!C207:AA207,\"\"))","v":""},{"$f":"IF(ISBLANK('Data Input'!A207),\"\",COUNTIF('Data Input'!C207:AA207,\"0\"))","v":""},{"$f":"IF(ISBLANK('Data Input'!A207),\"\",SUM(B202,C202))","v":""},{"$f":"IF(ISBLANK('Data Input'!A207),\"\",SUM('Data Input'!C207:AA207))","v":""},{"$f":"IF(E202=\"\",\"\",E202/(COUNTA('Data Input'!$C$8:$AA$8)))","v":""},{"$f":"IF(ISBLANK('Data Input'!A207),\"\",SUM('Data Input'!C207,'Data Input'!F207,'Data Input'!G207,'Data Input'!J207,'Data Input'!L207,'Data Input'!O207,'Data Input'!Q207,'Data Input'!R207,'Data Input'!U207))","v":""},{"$f":"IF(G202=\"\",\"\",G202/COUNTIF('Data Input'!$C$8:$AA$8,\"+\"))","v":""},{"$f":"IF(ISBLANK('Data Input'!A207),\"\",SUM('Data Input'!D207,'Data Input'!E207,'Data Input'!K207,'Data Input'!M207,'Data Input'!Y207))","v":""},{"$f":"IF(I202=\"\",\"\",I202/COUNTIF('Data Input'!$C$8:$AA$8,\"-\"))","v":""},{"$f":"IF(ISBLANK('Data Input'!A207),\"\",SUM('Data Input'!H207,'Data Input'!I207,'Data Input'!N207,'Data Input'!S207))","v":""},{"$f":"IF(K202=\"\",\"\",K202/COUNTIF('Data Input'!$C$8:$AA$8,\"x\"))","v":""},{"$f":"IF(ISBLANK('Data Input'!A207),\"\",SUM('Data Input'!P207,'Data Input'!V207,'Data Input'!W207))","v":""},{"$f":"IF(M202=\"\",\"\",M202/COUNTIF('Data Input'!$C$8:$AA$8,\"÷\"))","v":""},{"$f":"IF(ISBLANK('Data Input'!A207),\"\",SUM('Data Input'!T207,'Data Input'!X207,'Data Input'!Z207,'Data Input'!AA207))","v":""},{"$f":"IF(O202=\"\",\"\",O202/COUNTIF('Data Input'!$C$8:$AA$8,\"F\"))","v":""}]
[{"$f":"IF('Data Input'!A208=0,\"\",'Data Input'!A208)","v":""},{"$f":"IF(ISBLANK('Data Input'!A208),\"\",COUNTIF('Data Input'!C208:AA208,\"\"))","v":""},{"$f":"IF(ISBLANK('Data Input'!A208),\"\",COUNTIF('Data Input'!C208:AA208,\"0\"))","v":""},{"$f":"IF(ISBLANK('Data Input'!A208),\"\",SUM(B203,C203))","v":""},{"$f":"IF(ISBLANK('Data Input'!A208),\"\",SUM('Data Input'!C208:AA208))","v":""},{"$f":"IF(E203=\"\",\"\",E203/(COUNTA('Data Input'!$C$8:$AA$8)))","v":""},{"$f":"IF(ISBLANK('Data Input'!A208),\"\",SUM('Data Input'!C208,'Data Input'!F208,'Data Input'!G208,'Data Input'!J208,'Data Input'!L208,'Data Input'!O208,'Data Input'!Q208,'Data Input'!R208,'Data Input'!U208))","v":""},{"$f":"IF(G203=\"\",\"\",G203/COUNTIF('Data Input'!$C$8:$AA$8,\"+\"))","v":""},{"$f":"IF(ISBLANK('Data Input'!A208),\"\",SUM('Data Input'!D208,'Data Input'!E208,'Data Input'!K208,'Data Input'!M208,'Data Input'!Y208))","v":""},{"$f":"IF(I203=\"\",\"\",I203/COUNTIF('Data Input'!$C$8:$AA$8,\"-\"))","v":""},{"$f":"IF(ISBLANK('Data Input'!A208),\"\",SUM('Data Input'!H208,'Data Input'!I208,'Data Input'!N208,'Data Input'!S208))","v":""},{"$f":"IF(K203=\"\",\"\",K203/COUNTIF('Data Input'!$C$8:$AA$8,\"x\"))","v":""},{"$f":"IF(ISBLANK('Data Input'!A208),\"\",SUM('Data Input'!P208,'Data Input'!V208,'Data Input'!W208))","v":""},{"$f":"IF(M203=\"\",\"\",M203/COUNTIF('Data Input'!$C$8:$AA$8,\"÷\"))","v":""},{"$f":"IF(ISBLANK('Data Input'!A208),\"\",SUM('Data Input'!T208,'Data Input'!X208,'Data Input'!Z208,'Data Input'!AA208))","v":""},{"$f":"IF(O203=\"\",\"\",O203/COUNTIF('Data Input'!$C$8:$AA$8,\"F\"))","v":""}]
[{"$f":"IF('Data Input'!A209=0,\"\",'Data Input'!A209)","v":""},{"$f":"IF(ISBLANK('Data Input'!A209),\"\",COUNTIF('Data Input'!C209:AA209,\"\"))","v":""},{"$f":"IF(ISBLANK('Data Input'!A209),\"\",COUNTIF('Data Input'!C209:AA209,\"0\"))","v":""},{"$f":"IF(ISBLANK('Data Input'!A209),\"\",SUM(B204,C204))","v":""},{"$f":"IF(ISBLANK('Data Input'!A209),\"\",SUM('Data Input'!C209:AA209))","v":""},{"$f":"IF(E204=\"\",\"\",E204/(COUNTA('Data Input'!$C$8:$AA$8)))","v":""},{"$f":"IF(ISBLANK('Data Input'!A209),\"\",SUM('Data Input'!C209,'Data Input'!F209,'Data Input'!G209,'Data Input'!J209,'Data Input'!L209,'Data Input'!O209,'Data Input'!Q209,'Data Input'!R209,'Data Input'!U209))","v":""},{"$f":"IF(G204=\"\",\"\",G204/COUNTIF('Data Input'!$C$8:$AA$8,\"+\"))","v":""},{"$f":"IF(ISBLANK('Data Input'!A209),\"\",SUM('Data Input'!D209,'Data Input'!E209,'Data Input'!K209,'Data Input'!M209,'Data Input'!Y209))","v":""},{"$f":"IF(I204=\"\",\"\",I204/COUNTIF('Data Input'!$C$8:$AA$8,\"-\"))","v":""},{"$f":"IF(ISBLANK('Data Input'!A209),\"\",SUM('Data Input'!H209,'Data Input'!I209,'Data Input'!N209,'Data Input'!S209))","v":""},{"$f":"IF(K204=\"\",\"\",K204/COUNTIF('Data Input'!$C$8:$AA$8,\"x\"))","v":""},{"$f":"IF(ISBLANK('Data Input'!A209),\"\",SUM('Data Input'!P209,'Data Input'!V209,'Data Input'!W209))","v":""},{"$f":"IF(M204=\"\",\"\",M204/COUNTIF('Data Input'!$C$8:$AA$8,\"÷\"))","v":""},{"$f":"IF(ISBLANK('Data Input'!A209),\"\",SUM('Data Input'!T209,'Data Input'!X209,'Data Input'!Z209,'Data Input'!AA209))","v":""},{"$f":"IF(O204=\"\",\"\",O204/COUNTIF('Data Input'!$C$8:$AA$8,\"F\"))","v":""}]
[{"$f":"IF('Data Input'!A210=0,\"\",'Data Input'!A210)","v":""},{"$f":"IF(ISBLANK('Data Input'!A210),\"\",COUNTIF('Data Input'!C210:AA210,\"\"))","v":""},{"$f":"IF(ISBLANK('Data Input'!A210),\"\",COUNTIF('Data Input'!C210:AA210,\"0\"))","v":""},{"$f":"IF(ISBLANK('Data Input'!A210),\"\",SUM(B205,C205))","v":""},{"$f":"IF(ISBLANK('Data Input'!A210),\"\",SUM('Data Input'!C210:AA210))","v":""},{"$f":"IF(E205=\"\",\"\",E205/(COUNTA('Data Input'!$C$8:$AA$8)))","v":""},{"$f":"IF(ISBLANK('Data Input'!A210),\"\",SUM('Data Input'!C210,'Data Input'!F210,'Data Input'!G210,'Data Input'!J210,'Data Input'!L210,'Data Input'!O210,'Data Input'!Q210,'Data Input'!R210,'Data Input'!U210))","v":""},{"$f":"IF(G205=\"\",\"\",G205/COUNTIF('Data Input'!$C$8:$AA$8,\"+\"))","v":""},{"$f":"IF(ISBLANK('Data Input'!A210),\"\",SUM('Data Input'!D210,'Data Input'!E210,'Data Input'!K210,'Data Input'!M210,'Data Input'!Y210))","v":""},{"$f":"IF(I205=\"\",\"\",I205/COUNTIF('Data Input'!$C$8:$AA$8,\"-\"))","v":""},{"$f":"IF(ISBLANK('Data Input'!A210),\"\",SUM('Data Input'!H210,'Data Input'!I210,'Data Input'!N210,'Data Input'!S210))","v":""},{"$f":"IF(K205=\"\",\"\",K205/COUNTIF('Data Input'!$C$8:$AA$8,\"x\"))","v":""},{"$f":"IF(ISBLANK('Data Input'!A210),\"\",SUM('Data Input'!P210,'Data Input'!V210,'Data Input'!W210))","v":""},{"$f":"IF(M205=\"\",\"\",M205/COUNTIF('Data Input'!$C$8:$AA$8,\"÷\"))","v":""},{"$f":"IF(ISBLANK('Data Input'!A210),\"\",SUM('Data Input'!T210,'Data Input'!X210,'Data Input'!Z210,'Data Input'!AA210))","v":""},{"$f":"IF(O205=\"\",\"\",O205/COUNTIF('Data Input'!$C$8:$AA$8,\"F\"))","v":""}]
[{"$f":"IF('Data Input'!A211=0,\"\",'Data Input'!A211)","v":""},{"$f":"IF(ISBLANK('Data Input'!A211),\"\",COUNTIF('Data Input'!C211:AA211,\"\"))","v":""},{"$f":"IF(ISBLANK('Data Input'!A211),\"\",COUNTIF('Data Input'!C211:AA211,\"0\"))","v":""},{"$f":"IF(ISBLANK('Data Input'!A211),\"\",SUM(B206,C206))","v":""},{"$f":"IF(ISBLANK('Data Input'!A211),\"\",SUM('Data Input'!C211:AA211))","v":""},{"$f":"IF(E206=\"\",\"\",E206/(COUNTA('Data Input'!$C$8:$AA$8)))","v":""},{"$f":"IF(ISBLANK('Data Input'!A211),\"\",SUM('Data Input'!C211,'Data Input'!F211,'Data Input'!G211,'Data Input'!J211,'Data Input'!L211,'Data Input'!O211,'Data Input'!Q211,'Data Input'!R211,'Data Input'!U211))","v":""},{"$f":"IF(G206=\"\",\"\",G206/COUNTIF('Data Input'!$C$8:$AA$8,\"+\"))","v":""},{"$f":"IF(ISBLANK('Data Input'!A211),\"\",SUM('Data Input'!D211,'Data Input'!E211,'Data Input'!K211,'Data Input'!M211,'Data Input'!Y211))","v":""},{"$f":"IF(I206=\"\",\"\",I206/COUNTIF('Data Input'!$C$8:$AA$8,\"-\"))","v":""},{"$f":"IF(ISBLANK('Data Input'!A211),\"\",SUM('Data Input'!H211,'Data Input'!I211,'Data Input'!N211,'Data Input'!S211))","v":""},{"$f":"IF(K206=\"\",\"\",K206/COUNTIF('Data Input'!$C$8:$AA$8,\"x\"))","v":""},{"$f":"IF(ISBLANK('Data Input'!A211),\"\",SUM('Data Input'!P211,'Data Input'!V211,'Data Input'!W211))","v":""},{"$f":"IF(M206=\"\",\"\",M206/COUNTIF('Data Input'!$C$8:$AA$8,\"÷\"))","v":""},{"$f":"IF(ISBLANK('Data Input'!A211),\"\",SUM('Data Input'!T211,'Data Input'!X211,'Data Input'!Z211,'Data Input'!AA211))","v":""},{"$f":"IF(O206=\"\",\"\",O206/COUNTIF('Data Input'!$C$8:$AA$8,\"F\"))","v":""}]
[{"$f":"IF('Data Input'!A212=0,\"\",'Data Input'!A212)","v":""},{"$f":"IF(ISBLANK('Data Input'!A212),\"\",COUNTIF('Data Input'!C212:AA212,\"\"))","v":""},{"$f":"IF(ISBLANK('Data Input'!A212),\"\",COUNTIF('Data Input'!C212:AA212,\"0\"))","v":""},{"$f":"IF(ISBLANK('Data Input'!A212),\"\",SUM(B207,C207))","v":""},{"$f":"IF(ISBLANK('Data Input'!A212),\"\",SUM('Data Input'!C212:AA212))","v":""},{"$f":"IF(E207=\"\",\"\",E207/(COUNTA('Data Input'!$C$8:$AA$8)))","v":""},{"$f":"IF(ISBLANK('Data Input'!A212),\"\",SUM('Data Input'!C212,'Data Input'!F212,'Data Input'!G212,'Data Input'!J212,'Data Input'!L212,'Data Input'!O212,'Data Input'!Q212,'Data Input'!R212,'Data Input'!U212))","v":""},{"$f":"IF(G207=\"\",\"\",G207/COUNTIF('Data Input'!$C$8:$AA$8,\"+\"))","v":""},{"$f":"IF(ISBLANK('Data Input'!A212),\"\",SUM('Data Input'!D212,'Data Input'!E212,'Data Input'!K212,'Data Input'!M212,'Data Input'!Y212))","v":""},{"$f":"IF(I207=\"\",\"\",I207/COUNTIF('Data Input'!$C$8:$AA$8,\"-\"))","v":""},{"$f":"IF(ISBLANK('Data Input'!A212),\"\",SUM('Data Input'!H212,'Data Input'!I212,'Data Input'!N212,'Data Input'!S212))","v":""},{"$f":"IF(K207=\"\",\"\",K207/COUNTIF('Data Input'!$C$8:$AA$8,\"x\"))","v":""},{"$f":"IF(ISBLANK('Data Input'!A212),\"\",SUM('Data Input'!P212,'Data Input'!V212,'Data Input'!W212))","v":""},{"$f":"IF(M207=\"\",\"\",M207/COUNTIF('Data Input'!$C$8:$AA$8,\"÷\"))","v":""},{"$f":"IF(ISBLANK('Data Input'!A212),\"\",SUM('Data Input'!T212,'Data Input'!X212,'Data Input'!Z212,'Data Input'!AA212))","v":""},{"$f":"IF(O207=\"\",\"\",O207/COUNTIF('Data Input'!$C$8:$AA$8,\"F\"))","v":""}]
[{"$f":"IF('Data Input'!A213=0,\"\",'Data Input'!A213)","v":""},{"$f":"IF(ISBLANK('Data Input'!A213),\"\",COUNTIF('Data Input'!C213:AA213,\"\"))","v":""},{"$f":"IF(ISBLANK('Data Input'!A213),\"\",COUNTIF('Data Input'!C213:AA213,\"0\"))","v":""},{"$f":"IF(ISBLANK('Data Input'!A213),\"\",SUM(B208,C208))","v":""},{"$f":"IF(ISBLANK('Data Input'!A213),\"\",SUM('Data Input'!C213:AA213))","v":""},{"$f":"IF(E208=\"\",\"\",E208/(COUNTA('Data Input'!$C$8:$AA$8)))","v":""},{"$f":"IF(ISBLANK('Data Input'!A213),\"\",SUM('Data Input'!C213,'Data Input'!F213,'Data Input'!G213,'Data Input'!J213,'Data Input'!L213,'Data Input'!O213,'Data Input'!Q213,'Data Input'!R213,'Data Input'!U213))","v":""},{"$f":"IF(G208=\"\",\"\",G208/COUNTIF('Data Input'!$C$8:$AA$8,\"+\"))","v":""},{"$f":"IF(ISBLANK('Data Input'!A213),\"\",SUM('Data Input'!D213,'Data Input'!E213,'Data Input'!K213,'Data Input'!M213,'Data Input'!Y213))","v":""},{"$f":"IF(I208=\"\",\"\",I208/COUNTIF('Data Input'!$C$8:$AA$8,\"-\"))","v":""},{"$f":"IF(ISBLANK('Data Input'!A213),\"\",SUM('Data Input'!H213,'Data Input'!I213,'Data Input'!N213,'Data Input'!S213))","v":""},{"$f":"IF(K208=\"\",\"\",K208/COUNTIF('Data Input'!$C$8:$AA$8,\"x\"))","v":""},{"$f":"IF(ISBLANK('Data Input'!A213),\"\",SUM('Data Input'!P213,'Data Input'!V213,'Data Input'!W213))","v":""},{"$f":"IF(M208=\"\",\"\",M208/COUNTIF('Data Input'!$C$8:$AA$8,\"÷\"))","v":""},{"$f":"IF(ISBLANK('Data Input'!A213),\"\",SUM('Data Input'!T213,'Data Input'!X213,'Data Input'!Z213,'Data Input'!AA213))","v":""},{"$f":"IF(O208=\"\",\"\",O208/COUNTIF('Data Input'!$C$8:$AA$8,\"F\"))","v":""}]
[{"$f":"IF('Data Input'!A214=0,\"\",'Data Input'!A214)","v":""},{"$f":"IF(ISBLANK('Data Input'!A214),\"\",COUNTIF('Data Input'!C214:AA214,\"\"))","v":""},{"$f":"IF(ISBLANK('Data Input'!A214),\"\",COUNTIF('Data Input'!C214:AA214,\"0\"))","v":""},{"$f":"IF(ISBLANK('Data Input'!A214),\"\",SUM(B209,C209))","v":""},{"$f":"IF(ISBLANK('Data Input'!A214),\"\",SUM('Data Input'!C214:AA214))","v":""},{"$f":"IF(E209=\"\",\"\",E209/(COUNTA('Data Input'!$C$8:$AA$8)))","v":""},{"$f":"IF(ISBLANK('Data Input'!A214),\"\",SUM('Data Input'!C214,'Data Input'!F214,'Data Input'!G214,'Data Input'!J214,'Data Input'!L214,'Data Input'!O214,'Data Input'!Q214,'Data Input'!R214,'Data Input'!U214))","v":""},{"$f":"IF(G209=\"\",\"\",G209/COUNTIF('Data Input'!$C$8:$AA$8,\"+\"))","v":""},{"$f":"IF(ISBLANK('Data Input'!A214),\"\",SUM('Data Input'!D214,'Data Input'!E214,'Data Input'!K214,'Data Input'!M214,'Data Input'!Y214))","v":""},{"$f":"IF(I209=\"\",\"\",I209/COUNTIF('Data Input'!$C$8:$AA$8,\"-\"))","v":""},{"$f":"IF(ISBLANK('Data Input'!A214),\"\",SUM('Data Input'!H214,'Data Input'!I214,'Data Input'!N214,'Data Input'!S214))","v":""},{"$f":"IF(K209=\"\",\"\",K209/COUNTIF('Data Input'!$C$8:$AA$8,\"x\"))","v":""},{"$f":"IF(ISBLANK('Data Input'!A214),\"\",SUM('Data Input'!P214,'Data Input'!V214,'Data Input'!W214))","v":""},{"$f":"IF(M209=\"\",\"\",M209/COUNTIF('Data Input'!$C$8:$AA$8,\"÷\"))","v":""},{"$f":"IF(ISBLANK('Data Input'!A214),\"\",SUM('Data Input'!T214,'Data Input'!X214,'Data Input'!Z214,'Data Input'!AA214))","v":""},{"$f":"IF(O209=\"\",\"\",O209/COUNTIF('Data Input'!$C$8:$AA$8,\"F\"))","v":""}]
[{"$f":"IF('Data Input'!A215=0,\"\",'Data Input'!A215)","v":""},{"$f":"IF(ISBLANK('Data Input'!A215),\"\",COUNTIF('Data Input'!C215:AA215,\"\"))","v":""},{"$f":"IF(ISBLANK('Data Input'!A215),\"\",COUNTIF('Data Input'!C215:AA215,\"0\"))","v":""},{"$f":"IF(ISBLANK('Data Input'!A215),\"\",SUM(B210,C210))","v":""},{"$f":"IF(ISBLANK('Data Input'!A215),\"\",SUM('Data Input'!C215:AA215))","v":""},{"$f":"IF(E210=\"\",\"\",E210/(COUNTA('Data Input'!$C$8:$AA$8)))","v":""},{"$f":"IF(ISBLANK('Data Input'!A215),\"\",SUM('Data Input'!C215,'Data Input'!F215,'Data Input'!G215,'Data Input'!J215,'Data Input'!L215,'Data Input'!O215,'Data Input'!Q215,'Data Input'!R215,'Data Input'!U215))","v":""},{"$f":"IF(G210=\"\",\"\",G210/COUNTIF('Data Input'!$C$8:$AA$8,\"+\"))","v":""},{"$f":"IF(ISBLANK('Data Input'!A215),\"\",SUM('Data Input'!D215,'Data Input'!E215,'Data Input'!K215,'Data Input'!M215,'Data Input'!Y215))","v":""},{"$f":"IF(I210=\"\",\"\",I210/COUNTIF('Data Input'!$C$8:$AA$8,\"-\"))","v":""},{"$f":"IF(ISBLANK('Data Input'!A215),\"\",SUM('Data Input'!H215,'Data Input'!I215,'Data Input'!N215,'Data Input'!S215))","v":""},{"$f":"IF(K210=\"\",\"\",K210/COUNTIF('Data Input'!$C$8:$AA$8,\"x\"))","v":""},{"$f":"IF(ISBLANK('Data Input'!A215),\"\",SUM('Data Input'!P215,'Data Input'!V215,'Data Input'!W215))","v":""},{"$f":"IF(M210=\"\",\"\",M210/COUNTIF('Data Input'!$C$8:$AA$8,\"÷\"))","v":""},{"$f":"IF(ISBLANK('Data Input'!A215),\"\",SUM('Data Input'!T215,'Data Input'!X215,'Data Input'!Z215,'Data Input'!AA215))","v":""},{"$f":"IF(O210=\"\",\"\",O210/COUNTIF('Data Input'!$C$8:$AA$8,\"F\"))","v":""}]
[{"$f":"IF('Data Input'!A216=0,\"\",'Data Input'!A216)","v":""},{"$f":"IF(ISBLANK('Data Input'!A216),\"\",COUNTIF('Data Input'!C216:AA216,\"\"))","v":""},{"$f":"IF(ISBLANK('Data Input'!A216),\"\",COUNTIF('Data Input'!C216:AA216,\"0\"))","v":""},{"$f":"IF(ISBLANK('Data Input'!A216),\"\",SUM(B211,C211))","v":""},{"$f":"IF(ISBLANK('Data Input'!A216),\"\",SUM('Data Input'!C216:AA216))","v":""},{"$f":"IF(E211=\"\",\"\",E211/(COUNTA('Data Input'!$C$8:$AA$8)))","v":""},{"$f":"IF(ISBLANK('Data Input'!A216),\"\",SUM('Data Input'!C216,'Data Input'!F216,'Data Input'!G216,'Data Input'!J216,'Data Input'!L216,'Data Input'!O216,'Data Input'!Q216,'Data Input'!R216,'Data Input'!U216))","v":""},{"$f":"IF(G211=\"\",\"\",G211/COUNTIF('Data Input'!$C$8:$AA$8,\"+\"))","v":""},{"$f":"IF(ISBLANK('Data Input'!A216),\"\",SUM('Data Input'!D216,'Data Input'!E216,'Data Input'!K216,'Data Input'!M216,'Data Input'!Y216))","v":""},{"$f":"IF(I211=\"\",\"\",I211/COUNTIF('Data Input'!$C$8:$AA$8,\"-\"))","v":""},{"$f":"IF(ISBLANK('Data Input'!A216),\"\",SUM('Data Input'!H216,'Data Input'!I216,'Data Input'!N216,'Data Input'!S216))","v":""},{"$f":"IF(K211=\"\",\"\",K211/COUNTIF('Data Input'!$C$8:$AA$8,\"x\"))","v":""},{"$f":"IF(ISBLANK('Data Input'!A216),\"\",SUM('Data Input'!P216,'Data Input'!V216,'Data Input'!W216))","v":""},{"$f":"IF(M211=\"\",\"\",M211/COUNTIF('Data Input'!$C$8:$AA$8,\"÷\"))","v":""},{"$f":"IF(ISBLANK('Data Input'!A216),\"\",SUM('Data Input'!T216,'Data Input'!X216,'Data Input'!Z216,'Data Input'!AA216))","v":""},{"$f":"IF(O211=\"\",\"\",O211/COUNTIF('Data Input'!$C$8:$AA$8,\"F\"))","v":""}]
[{"$f":"IF('Data Input'!A217=0,\"\",'Data Input'!A217)","v":""},{"$f":"IF(ISBLANK('Data Input'!A217),\"\",COUNTIF('Data Input'!C217:AA217,\"\"))","v":""},{"$f":"IF(ISBLANK('Data Input'!A217),\"\",COUNTIF('Data Input'!C217:AA217,\"0\"))","v":""},{"$f":"IF(ISBLANK('Data Input'!A217),\"\",SUM(B212,C212))","v":""},{"$f":"IF(ISBLANK('Data Input'!A217),\"\",SUM('Data Input'!C217:AA217))","v":""},{"$f":"IF(E212=\"\",\"\",E212/(COUNTA('Data Input'!$C$8:$AA$8)))","v":""},{"$f":"IF(ISBLANK('Data Input'!A217),\"\",SUM('Data Input'!C217,'Data Input'!F217,'Data Input'!G217,'Data Input'!J217,'Data Input'!L217,'Data Input'!O217,'Data Input'!Q217,'Data Input'!R217,'Data Input'!U217))","v":""},{"$f":"IF(G212=\"\",\"\",G212/COUNTIF('Data Input'!$C$8:$AA$8,\"+\"))","v":""},{"$f":"IF(ISBLANK('Data Input'!A217),\"\",SUM('Data Input'!D217,'Data Input'!E217,'Data Input'!K217,'Data Input'!M217,'Data Input'!Y217))","v":""},{"$f":"IF(I212=\"\",\"\",I212/COUNTIF('Data Input'!$C$8:$AA$8,\"-\"))","v":""},{"$f":"IF(ISBLANK('Data Input'!A217),\"\",SUM('Data Input'!H217,'Data Input'!I217,'Data Input'!N217,'Data Input'!S217))","v":""},{"$f":"IF(K212=\"\",\"\",K212/COUNTIF('Data Input'!$C$8:$AA$8,\"x\"))","v":""},{"$f":"IF(ISBLANK('Data Input'!A217),\"\",SUM('Data Input'!P217,'Data Input'!V217,'Data Input'!W217))","v":""},{"$f":"IF(M212=\"\",\"\",M212/COUNTIF('Data Input'!$C$8:$AA$8,\"÷\"))","v":""},{"$f":"IF(ISBLANK('Data Input'!A217),\"\",SUM('Data Input'!T217,'Data Input'!X217,'Data Input'!Z217,'Data Input'!AA217))","v":""},{"$f":"IF(O212=\"\",\"\",O212/COUNTIF('Data Input'!$C$8:$AA$8,\"F\"))","v":""}]
[{"$f":"IF('Data Input'!A218=0,\"\",'Data Input'!A218)","v":""},{"$f":"IF(ISBLANK('Data Input'!A218),\"\",COUNTIF('Data Input'!C218:AA218,\"\"))","v":""},{"$f":"IF(ISBLANK('Data Input'!A218),\"\",COUNTIF('Data Input'!C218:AA218,\"0\"))","v":""},{"$f":"IF(ISBLANK('Data Input'!A218),\"\",SUM(B213,C213))","v":""},{"$f":"IF(ISBLANK('Data Input'!A218),\"\",SUM('Data Input'!C218:AA218))","v":""},{"$f":"IF(E213=\"\",\"\",E213/(COUNTA('Data Input'!$C$8:$AA$8)))","v":""},{"$f":"IF(ISBLANK('Data Input'!A218),\"\",SUM('Data Input'!C218,'Data Input'!F218,'Data Input'!G218,'Data Input'!J218,'Data Input'!L218,'Data Input'!O218,'Data Input'!Q218,'Data Input'!R218,'Data Input'!U218))","v":""},{"$f":"IF(G213=\"\",\"\",G213/COUNTIF('Data Input'!$C$8:$AA$8,\"+\"))","v":""},{"$f":"IF(ISBLANK('Data Input'!A218),\"\",SUM('Data Input'!D218,'Data Input'!E218,'Data Input'!K218,'Data Input'!M218,'Data Input'!Y218))","v":""},{"$f":"IF(I213=\"\",\"\",I213/COUNTIF('Data Input'!$C$8:$AA$8,\"-\"))","v":""},{"$f":"IF(ISBLANK('Data Input'!A218),\"\",SUM('Data Input'!H218,'Data Input'!I218,'Data Input'!N218,'Data Input'!S218))","v":""},{"$f":"IF(K213=\"\",\"\",K213/COUNTIF('Data Input'!$C$8:$AA$8,\"x\"))","v":""},{"$f":"IF(ISBLANK('Data Input'!A218),\"\",SUM('Data Input'!P218,'Data Input'!V218,'Data Input'!W218))","v":""},{"$f":"IF(M213=\"\",\"\",M213/COUNTIF('Data Input'!$C$8:$AA$8,\"÷\"))","v":""},{"$f":"IF(ISBLANK('Data Input'!A218),\"\",SUM('Data Input'!T218,'Data Input'!X218,'Data Input'!Z218,'Data Input'!AA218))","v":""},{"$f":"IF(O213=\"\",\"\",O213/COUNTIF('Data Input'!$C$8:$AA$8,\"F\"))","v":""}]
[{"$f":"IF('Data Input'!A219=0,\"\",'Data Input'!A219)","v":""},{"$f":"IF(ISBLANK('Data Input'!A219),\"\",COUNTIF('Data Input'!C219:AA219,\"\"))","v":""},{"$f":"IF(ISBLANK('Data Input'!A219),\"\",COUNTIF('Data Input'!C219:AA219,\"0\"))","v":""},{"$f":"IF(ISBLANK('Data Input'!A219),\"\",SUM(B214,C214))","v":""},{"$f":"IF(ISBLANK('Data Input'!A219),\"\",SUM('Data Input'!C219:AA219))","v":""},{"$f":"IF(E214=\"\",\"\",E214/(COUNTA('Data Input'!$C$8:$AA$8)))","v":""},{"$f":"IF(ISBLANK('Data Input'!A219),\"\",SUM('Data Input'!C219,'Data Input'!F219,'Data Input'!G219,'Data Input'!J219,'Data Input'!L219,'Data Input'!O219,'Data Input'!Q219,'Data Input'!R219,'Data Input'!U219))","v":""},{"$f":"IF(G214=\"\",\"\",G214/COUNTIF('Data Input'!$C$8:$AA$8,\"+\"))","v":""},{"$f":"IF(ISBLANK('Data Input'!A219),\"\",SUM('Data Input'!D219,'Data Input'!E219,'Data Input'!K219,'Data Input'!M219,'Data Input'!Y219))","v":""},{"$f":"IF(I214=\"\",\"\",I214/COUNTIF('Data Input'!$C$8:$AA$8,\"-\"))","v":""},{"$f":"IF(ISBLANK('Data Input'!A219),\"\",SUM('Data Input'!H219,'Data Input'!I219,'Data Input'!N219,'Data Input'!S219))","v":""},{"$f":"IF(K214=\"\",\"\",K214/COUNTIF('Data Input'!$C$8:$AA$8,\"x\"))","v":""},{"$f":"IF(ISBLANK('Data Input'!A219),\"\",SUM('Data Input'!P219,'Data Input'!V219,'Data Input'!W219))","v":""},{"$f":"IF(M214=\"\",\"\",M214/COUNTIF('Data Input'!$C$8:$AA$8,\"÷\"))","v":""},{"$f":"IF(ISBLANK('Data Input'!A219),\"\",SUM('Data Input'!T219,'Data Input'!X219,'Data Input'!Z219,'Data Input'!AA219))","v":""},{"$f":"IF(O214=\"\",\"\",O214/COUNTIF('Data Input'!$C$8:$AA$8,\"F\"))","v":""}]
[{"$f":"IF('Data Input'!A220=0,\"\",'Data Input'!A220)","v":""},{"$f":"IF(ISBLANK('Data Input'!A220),\"\",COUNTIF('Data Input'!C220:AA220,\"\"))","v":""},{"$f":"IF(ISBLANK('Data Input'!A220),\"\",COUNTIF('Data Input'!C220:AA220,\"0\"))","v":""},{"$f":"IF(ISBLANK('Data Input'!A220),\"\",SUM(B215,C215))","v":""},{"$f":"IF(ISBLANK('Data Input'!A220),\"\",SUM('Data Input'!C220:AA220))","v":""},{"$f":"IF(E215=\"\",\"\",E215/(COUNTA('Data Input'!$C$8:$AA$8)))","v":""},{"$f":"IF(ISBLANK('Data Input'!A220),\"\",SUM('Data Input'!C220,'Data Input'!F220,'Data Input'!G220,'Data Input'!J220,'Data Input'!L220,'Data Input'!O220,'Data Input'!Q220,'Data Input'!R220,'Data Input'!U220))","v":""},{"$f":"IF(G215=\"\",\"\",G215/COUNTIF('Data Input'!$C$8:$AA$8,\"+\"))","v":""},{"$f":"IF(ISBLANK('Data Input'!A220),\"\",SUM('Data Input'!D220,'Data Input'!E220,'Data Input'!K220,'Data Input'!M220,'Data Input'!Y220))","v":""},{"$f":"IF(I215=\"\",\"\",I215/COUNTIF('Data Input'!$C$8:$AA$8,\"-\"))","v":""},{"$f":"IF(ISBLANK('Data Input'!A220),\"\",SUM('Data Input'!H220,'Data Input'!I220,'Data Input'!N220,'Data Input'!S220))","v":""},{"$f":"IF(K215=\"\",\"\",K215/COUNTIF('Data Input'!$C$8:$AA$8,\"x\"))","v":""},{"$f":"IF(ISBLANK('Data Input'!A220),\"\",SUM('Data Input'!P220,'Data Input'!V220,'Data Input'!W220))","v":""},{"$f":"IF(M215=\"\",\"\",M215/COUNTIF('Data Input'!$C$8:$AA$8,\"÷\"))","v":""},{"$f":"IF(ISBLANK('Data Input'!A220),\"\",SUM('Data Input'!T220,'Data Input'!X220,'Data Input'!Z220,'Data Input'!AA220))","v":""},{"$f":"IF(O215=\"\",\"\",O215/COUNTIF('Data Input'!$C$8:$AA$8,\"F\"))","v":""}]
[{"$f":"IF('Data Input'!A221=0,\"\",'Data Input'!A221)","v":""},{"$f":"IF(ISBLANK('Data Input'!A221),\"\",COUNTIF('Data Input'!C221:AA221,\"\"))","v":""},{"$f":"IF(ISBLANK('Data Input'!A221),\"\",COUNTIF('Data Input'!C221:AA221,\"0\"))","v":""},{"$f":"IF(ISBLANK('Data Input'!A221),\"\",SUM(B216,C216))","v":""},{"$f":"IF(ISBLANK('Data Input'!A221),\"\",SUM('Data Input'!C221:AA221))","v":""},{"$f":"IF(E216=\"\",\"\",E216/(COUNTA('Data Input'!$C$8:$AA$8)))","v":""},{"$f":"IF(ISBLANK('Data Input'!A221),\"\",SUM('Data Input'!C221,'Data Input'!F221,'Data Input'!G221,'Data Input'!J221,'Data Input'!L221,'Data Input'!O221,'Data Input'!Q221,'Data Input'!R221,'Data Input'!U221))","v":""},{"$f":"IF(G216=\"\",\"\",G216/COUNTIF('Data Input'!$C$8:$AA$8,\"+\"))","v":""},{"$f":"IF(ISBLANK('Data Input'!A221),\"\",SUM('Data Input'!D221,'Data Input'!E221,'Data Input'!K221,'Data Input'!M221,'Data Input'!Y221))","v":""},{"$f":"IF(I216=\"\",\"\",I216/COUNTIF('Data Input'!$C$8:$AA$8,\"-\"))","v":""},{"$f":"IF(ISBLANK('Data Input'!A221),\"\",SUM('Data Input'!H221,'Data Input'!I221,'Data Input'!N221,'Data Input'!S221))","v":""},{"$f":"IF(K216=\"\",\"\",K216/COUNTIF('Data Input'!$C$8:$AA$8,\"x\"))","v":""},{"$f":"IF(ISBLANK('Data Input'!A221),\"\",SUM('Data Input'!P221,'Data Input'!V221,'Data Input'!W221))","v":""},{"$f":"IF(M216=\"\",\"\",M216/COUNTIF('Data Input'!$C$8:$AA$8,\"÷\"))","v":""},{"$f":"IF(ISBLANK('Data Input'!A221),\"\",SUM('Data Input'!T221,'Data Input'!X221,'Data Input'!Z221,'Data Input'!AA221))","v":""},{"$f":"IF(O216=\"\",\"\",O216/COUNTIF('Data Input'!$C$8:$AA$8,\"F\"))","v":""}]
[{"$f":"IF('Data Input'!A222=0,\"\",'Data Input'!A222)","v":""},{"$f":"IF(ISBLANK('Data Input'!A222),\"\",COUNTIF('Data Input'!C222:AA222,\"\"))","v":""},{"$f":"IF(ISBLANK('Data Input'!A222),\"\",COUNTIF('Data Input'!C222:AA222,\"0\"))","v":""},{"$f":"IF(ISBLANK('Data Input'!A222),\"\",SUM(B217,C217))","v":""},{"$f":"IF(ISBLANK('Data Input'!A222),\"\",SUM('Data Input'!C222:AA222))","v":""},{"$f":"IF(E217=\"\",\"\",E217/(COUNTA('Data Input'!$C$8:$AA$8)))","v":""},{"$f":"IF(ISBLANK('Data Input'!A222),\"\",SUM('Data Input'!C222,'Data Input'!F222,'Data Input'!G222,'Data Input'!J222,'Data Input'!L222,'Data Input'!O222,'Data Input'!Q222,'Data Input'!R222,'Data Input'!U222))","v":""},{"$f":"IF(G217=\"\",\"\",G217/COUNTIF('Data Input'!$C$8:$AA$8,\"+\"))","v":""},{"$f":"IF(ISBLANK('Data Input'!A222),\"\",SUM('Data Input'!D222,'Data Input'!E222,'Data Input'!K222,'Data Input'!M222,'Data Input'!Y222))","v":""},{"$f":"IF(I217=\"\",\"\",I217/COUNTIF('Data Input'!$C$8:$AA$8,\"-\"))","v":""},{"$f":"IF(ISBLANK('Data Input'!A222),\"\",SUM('Data Input'!H222,'Data Input'!I222,'Data Input'!N222,'Data Input'!S222))","v":""},{"$f":"IF(K217=\"\",\"\",K217/COUNTIF('Data Input'!$C$8:$AA$8,\"x\"))","v":""},{"$f":"IF(ISBLANK('Data Input'!A222),\"\",SUM('Data Input'!P222,'Data Input'!V222,'Data Input'!W222))","v":""},{"$f":"IF(M217=\"\",\"\",M217/COUNTIF('Data Input'!$C$8:$AA$8,\"÷\"))","v":""},{"$f":"IF(ISBLANK('Data Input'!A222),\"\",SUM('Data Input'!T222,'Data Input'!X222,'Data Input'!Z222,'Data Input'!AA222))","v":""},{"$f":"IF(O217=\"\",\"\",O217/COUNTIF('Data Input'!$C$8:$AA$8,\"F\"))","v":""}]
[{"$f":"IF('Data Input'!A223=0,\"\",'Data Input'!A223)","v":""},{"$f":"IF(ISBLANK('Data Input'!A223),\"\",COUNTIF('Data Input'!C223:AA223,\"\"))","v":""},{"$f":"IF(ISBLANK('Data Input'!A223),\"\",COUNTIF('Data Input'!C223:AA223,\"0\"))","v":""},{"$f":"IF(ISBLANK('Data Input'!A223),\"\",SUM(B218,C218))","v":""},{"$f":"IF(ISBLANK('Data Input'!A223),\"\",SUM('Data Input'!C223:AA223))","v":""},{"$f":"IF(E218=\"\",\"\",E218/(COUNTA('Data Input'!$C$8:$AA$8)))","v":""},{"$f":"IF(ISBLANK('Data Input'!A223),\"\",SUM('Data Input'!C223,'Data Input'!F223,'Data Input'!G223,'Data Input'!J223,'Data Input'!L223,'Data Input'!O223,'Data Input'!Q223,'Data Input'!R223,'Data Input'!U223))","v":""},{"$f":"IF(G218=\"\",\"\",G218/COUNTIF('Data Input'!$C$8:$AA$8,\"+\"))","v":""},{"$f":"IF(ISBLANK('Data Input'!A223),\"\",SUM('Data Input'!D223,'Data Input'!E223,'Data Input'!K223,'Data Input'!M223,'Data Input'!Y223))","v":""},{"$f":"IF(I218=\"\",\"\",I218/COUNTIF('Data Input'!$C$8:$AA$8,\"-\"))","v":""},{"$f":"IF(ISBLANK('Data Input'!A223),\"\",SUM('Data Input'!H223,'Data Input'!I223,'Data Input'!N223,'Data Input'!S223))","v":""},{"$f":"IF(K218=\"\",\"\",K218/COUNTIF('Data Input'!$C$8:$AA$8,\"x\"))","v":""},{"$f":"IF(ISBLANK('Data Input'!A223),\"\",SUM('Data Input'!P223,'Data Input'!V223,'Data Input'!W223))","v":""},{"$f":"IF(M218=\"\",\"\",M218/COUNTIF('Data Input'!$C$8:$AA$8,\"÷\"))","v":""},{"$f":"IF(ISBLANK('Data Input'!A223),\"\",SUM('Data Input'!T223,'Data Input'!X223,'Data Input'!Z223,'Data Input'!AA223))","v":""},{"$f":"IF(O218=\"\",\"\",O218/COUNTIF('Data Input'!$C$8:$AA$8,\"F\"))","v":""}]
[{"$f":"IF('Data Input'!A224=0,\"\",'Data Input'!A224)","v":""},{"$f":"IF(ISBLANK('Data Input'!A224),\"\",COUNTIF('Data Input'!C224:AA224,\"\"))","v":""},{"$f":"IF(ISBLANK('Data Input'!A224),\"\",COUNTIF('Data Input'!C224:AA224,\"0\"))","v":""},{"$f":"IF(ISBLANK('Data Input'!A224),\"\",SUM(B219,C219))","v":""},{"$f":"IF(ISBLANK('Data Input'!A224),\"\",SUM('Data Input'!C224:AA224))","v":""},{"$f":"IF(E219=\"\",\"\",E219/(COUNTA('Data Input'!$C$8:$AA$8)))","v":""},{"$f":"IF(ISBLANK('Data Input'!A224),\"\",SUM('Data Input'!C224,'Data Input'!F224,'Data Input'!G224,'Data Input'!J224,'Data Input'!L224,'Data Input'!O224,'Data Input'!Q224,'Data Input'!R224,'Data Input'!U224))","v":""},{"$f":"IF(G219=\"\",\"\",G219/COUNTIF('Data Input'!$C$8:$AA$8,\"+\"))","v":""},{"$f":"IF(ISBLANK('Data Input'!A224),\"\",SUM('Data Input'!D224,'Data Input'!E224,'Data Input'!K224,'Data Input'!M224,'Data Input'!Y224))","v":""},{"$f":"IF(I219=\"\",\"\",I219/COUNTIF('Data Input'!$C$8:$AA$8,\"-\"))","v":""},{"$f":"IF(ISBLANK('Data Input'!A224),\"\",SUM('Data Input'!H224,'Data Input'!I224,'Data Input'!N224,'Data Input'!S224))","v":""},{"$f":"IF(K219=\"\",\"\",K219/COUNTIF('Data Input'!$C$8:$AA$8,\"x\"))","v":""},{"$f":"IF(ISBLANK('Data Input'!A224),\"\",SUM('Data Input'!P224,'Data Input'!V224,'Data Input'!W224))","v":""},{"$f":"IF(M219=\"\",\"\",M219/COUNTIF('Data Input'!$C$8:$AA$8,\"÷\"))","v":""},{"$f":"IF(ISBLANK('Data Input'!A224),\"\",SUM('Data Input'!T224,'Data Input'!X224,'Data Input'!Z224,'Data Input'!AA224))","v":""},{"$f":"IF(O219=\"\",\"\",O219/COUNTIF('Data Input'!$C$8:$AA$8,\"F\"))","v":""}]
[{"$f":"IF('Data Input'!A225=0,\"\",'Data Input'!A225)","v":""},{"$f":"IF(ISBLANK('Data Input'!A225),\"\",COUNTIF('Data Input'!C225:AA225,\"\"))","v":""},{"$f":"IF(ISBLANK('Data Input'!A225),\"\",COUNTIF('Data Input'!C225:AA225,\"0\"))","v":""},{"$f":"IF(ISBLANK('Data Input'!A225),\"\",SUM(B220,C220))","v":""},{"$f":"IF(ISBLANK('Data Input'!A225),\"\",SUM('Data Input'!C225:AA225))","v":""},{"$f":"IF(E220=\"\",\"\",E220/(COUNTA('Data Input'!$C$8:$AA$8)))","v":""},{"$f":"IF(ISBLANK('Data Input'!A225),\"\",SUM('Data Input'!C225,'Data Input'!F225,'Data Input'!G225,'Data Input'!J225,'Data Input'!L225,'Data Input'!O225,'Data Input'!Q225,'Data Input'!R225,'Data Input'!U225))","v":""},{"$f":"IF(G220=\"\",\"\",G220/COUNTIF('Data Input'!$C$8:$AA$8,\"+\"))","v":""},{"$f":"IF(ISBLANK('Data Input'!A225),\"\",SUM('Data Input'!D225,'Data Input'!E225,'Data Input'!K225,'Data Input'!M225,'Data Input'!Y225))","v":""},{"$f":"IF(I220=\"\",\"\",I220/COUNTIF('Data Input'!$C$8:$AA$8,\"-\"))","v":""},{"$f":"IF(ISBLANK('Data Input'!A225),\"\",SUM('Data Input'!H225,'Data Input'!I225,'Data Input'!N225,'Data Input'!S225))","v":""},{"$f":"IF(K220=\"\",\"\",K220/COUNTIF('Data Input'!$C$8:$AA$8,\"x\"))","v":""},{"$f":"IF(ISBLANK('Data Input'!A225),\"\",SUM('Data Input'!P225,'Data Input'!V225,'Data Input'!W225))","v":""},{"$f":"IF(M220=\"\",\"\",M220/COUNTIF('Data Input'!$C$8:$AA$8,\"÷\"))","v":""},{"$f":"IF(ISBLANK('Data Input'!A225),\"\",SUM('Data Input'!T225,'Data Input'!X225,'Data Input'!Z225,'Data Input'!AA225))","v":""},{"$f":"IF(O220=\"\",\"\",O220/COUNTIF('Data Input'!$C$8:$AA$8,\"F\"))","v":""}]
[{"$f":"IF('Data Input'!A226=0,\"\",'Data Input'!A226)","v":""},{"$f":"IF(ISBLANK('Data Input'!A226),\"\",COUNTIF('Data Input'!C226:AA226,\"\"))","v":""},{"$f":"IF(ISBLANK('Data Input'!A226),\"\",COUNTIF('Data Input'!C226:AA226,\"0\"))","v":""},{"$f":"IF(ISBLANK('Data Input'!A226),\"\",SUM(B221,C221))","v":""},{"$f":"IF(ISBLANK('Data Input'!A226),\"\",SUM('Data Input'!C226:AA226))","v":""},{"$f":"IF(E221=\"\",\"\",E221/(COUNTA('Data Input'!$C$8:$AA$8)))","v":""},{"$f":"IF(ISBLANK('Data Input'!A226),\"\",SUM('Data Input'!C226,'Data Input'!F226,'Data Input'!G226,'Data Input'!J226,'Data Input'!L226,'Data Input'!O226,'Data Input'!Q226,'Data Input'!R226,'Data Input'!U226))","v":""},{"$f":"IF(G221=\"\",\"\",G221/COUNTIF('Data Input'!$C$8:$AA$8,\"+\"))","v":""},{"$f":"IF(ISBLANK('Data Input'!A226),\"\",SUM('Data Input'!D226,'Data Input'!E226,'Data Input'!K226,'Data Input'!M226,'Data Input'!Y226))","v":""},{"$f":"IF(I221=\"\",\"\",I221/COUNTIF('Data Input'!$C$8:$AA$8,\"-\"))","v":""},{"$f":"IF(ISBLANK('Data Input'!A226),\"\",SUM('Data Input'!H226,'Data Input'!I226,'Data Input'!N226,'Data Input'!S226))","v":""},{"$f":"IF(K221=\"\",\"\",K221/COUNTIF('Data Input'!$C$8:$AA$8,\"x\"))","v":""},{"$f":"IF(ISBLANK('Data Input'!A226),\"\",SUM('Data Input'!P226,'Data Input'!V226,'Data Input'!W226))","v":""},{"$f":"IF(M221=\"\",\"\",M221/COUNTIF('Data Input'!$C$8:$AA$8,\"÷\"))","v":""},{"$f":"IF(ISBLANK('Data Input'!A226),\"\",SUM('Data Input'!T226,'Data Input'!X226,'Data Input'!Z226,'Data Input'!AA226))","v":""},{"$f":"IF(O221=\"\",\"\",O221/COUNTIF('Data Input'!$C$8:$AA$8,\"F\"))","v":""}]
[{"$f":"IF('Data Input'!A227=0,\"\",'Data Input'!A227)","v":""},{"$f":"IF(ISBLANK('Data Input'!A227),\"\",COUNTIF('Data Input'!C227:AA227,\"\"))","v":""},{"$f":"IF(ISBLANK('Data Input'!A227),\"\",COUNTIF('Data Input'!C227:AA227,\"0\"))","v":""},{"$f":"IF(ISBLANK('Data Input'!A227),\"\",SUM(B222,C222))","v":""},{"$f":"IF(ISBLANK('Data Input'!A227),\"\",SUM('Data Input'!C227:AA227))","v":""},{"$f":"IF(E222=\"\",\"\",E222/(COUNTA('Data Input'!$C$8:$AA$8)))","v":""},{"$f":"IF(ISBLANK('Data Input'!A227),\"\",SUM('Data Input'!C227,'Data Input'!F227,'Data Input'!G227,'Data Input'!J227,'Data Input'!L227,'Data Input'!O227,'Data Input'!Q227,'Data Input'!R227,'Data Input'!U227))","v":""},{"$f":"IF(G222=\"\",\"\",G222/COUNTIF('Data Input'!$C$8:$AA$8,\"+\"))","v":""},{"$f":"IF(ISBLANK('Data Input'!A227),\"\",SUM('Data Input'!D227,'Data Input'!E227,'Data Input'!K227,'Data Input'!M227,'Data Input'!Y227))","v":""},{"$f":"IF(I222=\"\",\"\",I222/COUNTIF('Data Input'!$C$8:$AA$8,\"-\"))","v":""},{"$f":"IF(ISBLANK('Data Input'!A227),\"\",SUM('Data Input'!H227,'Data Input'!I227,'Data Input'!N227,'Data Input'!S227))","v":""},{"$f":"IF(K222=\"\",\"\",K222/COUNTIF('Data Input'!$C$8:$AA$8,\"x\"))","v":""},{"$f":"IF(ISBLANK('Data Input'!A227),\"\",SUM('Data Input'!P227,'Data Input'!V227,'Data Input'!W227))","v":""},{"$f":"IF(M222=\"\",\"\",M222/COUNTIF('Data Input'!$C$8:$AA$8,\"÷\"))","v":""},{"$f":"IF(ISBLANK('Data Input'!A227),\"\",SUM('Data Input'!T227,'Data Input'!X227,'Data Input'!Z227,'Data Input'!AA227))","v":""},{"$f":"IF(O222=\"\",\"\",O222/COUNTIF('Data Input'!$C$8:$AA$8,\"F\"))","v":""}]
[{"$f":"IF('Data Input'!A228=0,\"\",'Data Input'!A228)","v":""},{"$f":"IF(ISBLANK('Data Input'!A228),\"\",COUNTIF('Data Input'!C228:AA228,\"\"))","v":""},{"$f":"IF(ISBLANK('Data Input'!A228),\"\",COUNTIF('Data Input'!C228:AA228,\"0\"))","v":""},{"$f":"IF(ISBLANK('Data Input'!A228),\"\",SUM(B223,C223))","v":""},{"$f":"IF(ISBLANK('Data Input'!A228),\"\",SUM('Data Input'!C228:AA228))","v":""},{"$f":"IF(E223=\"\",\"\",E223/(COUNTA('Data Input'!$C$8:$AA$8)))","v":""},{"$f":"IF(ISBLANK('Data Input'!A228),\"\",SUM('Data Input'!C228,'Data Input'!F228,'Data Input'!G228,'Data Input'!J228,'Data Input'!L228,'Data Input'!O228,'Data Input'!Q228,'Data Input'!R228,'Data Input'!U228))","v":""},{"$f":"IF(G223=\"\",\"\",G223/COUNTIF('Data Input'!$C$8:$AA$8,\"+\"))","v":""},{"$f":"IF(ISBLANK('Data Input'!A228),\"\",SUM('Data Input'!D228,'Data Input'!E228,'Data Input'!K228,'Data Input'!M228,'Data Input'!Y228))","v":""},{"$f":"IF(I223=\"\",\"\",I223/COUNTIF('Data Input'!$C$8:$AA$8,\"-\"))","v":""},{"$f":"IF(ISBLANK('Data Input'!A228),\"\",SUM('Data Input'!H228,'Data Input'!I228,'Data Input'!N228,'Data Input'!S228))","v":""},{"$f":"IF(K223=\"\",\"\",K223/COUNTIF('Data Input'!$C$8:$AA$8,\"x\"))","v":""},{"$f":"IF(ISBLANK('Data Input'!A228),\"\",SUM('Data Input'!P228,'Data Input'!V228,'Data Input'!W228))","v":""},{"$f":"IF(M223=\"\",\"\",M223/COUNTIF('Data Input'!$C$8:$AA$8,\"÷\"))","v":""},{"$f":"IF(ISBLANK('Data Input'!A228),\"\",SUM('Data Input'!T228,'Data Input'!X228,'Data Input'!Z228,'Data Input'!AA228))","v":""},{"$f":"IF(O223=\"\",\"\",O223/COUNTIF('Data Input'!$C$8:$AA$8,\"F\"))","v":""}]
[{"$f":"IF('Data Input'!A229=0,\"\",'Data Input'!A229)","v":""},{"$f":"IF(ISBLANK('Data Input'!A229),\"\",COUNTIF('Data Input'!C229:AA229,\"\"))","v":""},{"$f":"IF(ISBLANK('Data Input'!A229),\"\",COUNTIF('Data Input'!C229:AA229,\"0\"))","v":""},{"$f":"IF(ISBLANK('Data Input'!A229),\"\",SUM(B224,C224))","v":""},{"$f":"IF(ISBLANK('Data Input'!A229),\"\",SUM('Data Input'!C229:AA229))","v":""},{"$f":"IF(E224=\"\",\"\",E224/(COUNTA('Data Input'!$C$8:$AA$8)))","v":""},{"$f":"IF(ISBLANK('Data Input'!A229),\"\",SUM('Data Input'!C229,'Data Input'!F229,'Data Input'!G229,'Data Input'!J229,'Data Input'!L229,'Data Input'!O229,'Data Input'!Q229,'Data Input'!R229,'Data Input'!U229))","v":""},{"$f":"IF(G224=\"\",\"\",G224/COUNTIF('Data Input'!$C$8:$AA$8,\"+\"))","v":""},{"$f":"IF(ISBLANK('Data Input'!A229),\"\",SUM('Data Input'!D229,'Data Input'!E229,'Data Input'!K229,'Data Input'!M229,'Data Input'!Y229))","v":""},{"$f":"IF(I224=\"\",\"\",I224/COUNTIF('Data Input'!$C$8:$AA$8,\"-\"))","v":""},{"$f":"IF(ISBLANK('Data Input'!A229),\"\",SUM('Data Input'!H229,'Data Input'!I229,'Data Input'!N229,'Data Input'!S229))","v":""},{"$f":"IF(K224=\"\",\"\",K224/COUNTIF('Data Input'!$C$8:$AA$8,\"x\"))","v":""},{"$f":"IF(ISBLANK('Data Input'!A229),\"\",SUM('Data Input'!P229,'Data Input'!V229,'Data Input'!W229))","v":""},{"$f":"IF(M224=\"\",\"\",M224/COUNTIF('Data Input'!$C$8:$AA$8,\"÷\"))","v":""},{"$f":"IF(ISBLANK('Data Input'!A229),\"\",SUM('Data Input'!T229,'Data Input'!X229,'Data Input'!Z229,'Data Input'!AA229))","v":""},{"$f":"IF(O224=\"\",\"\",O224/COUNTIF('Data Input'!$C$8:$AA$8,\"F\"))","v":""}]
[{"$f":"IF('Data Input'!A230=0,\"\",'Data Input'!A230)","v":""},{"$f":"IF(ISBLANK('Data Input'!A230),\"\",COUNTIF('Data Input'!C230:AA230,\"\"))","v":""},{"$f":"IF(ISBLANK('Data Input'!A230),\"\",COUNTIF('Data Input'!C230:AA230,\"0\"))","v":""},{"$f":"IF(ISBLANK('Data Input'!A230),\"\",SUM(B225,C225))","v":""},{"$f":"IF(ISBLANK('Data Input'!A230),\"\",SUM('Data Input'!C230:AA230))","v":""},{"$f":"IF(E225=\"\",\"\",E225/(COUNTA('Data Input'!$C$8:$AA$8)))","v":""},{"$f":"IF(ISBLANK('Data Input'!A230),\"\",SUM('Data Input'!C230,'Data Input'!F230,'Data Input'!G230,'Data Input'!J230,'Data Input'!L230,'Data Input'!O230,'Data Input'!Q230,'Data Input'!R230,'Data Input'!U230))","v":""},{"$f":"IF(G225=\"\",\"\",G225/COUNTIF('Data Input'!$C$8:$AA$8,\"+\"))","v":""},{"$f":"IF(ISBLANK('Data Input'!A230),\"\",SUM('Data Input'!D230,'Data Input'!E230,'Data Input'!K230,'Data Input'!M230,'Data Input'!Y230))","v":""},{"$f":"IF(I225=\"\",\"\",I225/COUNTIF('Data Input'!$C$8:$AA$8,\"-\"))","v":""},{"$f":"IF(ISBLANK('Data Input'!A230),\"\",SUM('Data Input'!H230,'Data Input'!I230,'Data Input'!N230,'Data Input'!S230))","v":""},{"$f":"IF(K225=\"\",\"\",K225/COUNTIF('Data Input'!$C$8:$AA$8,\"x\"))","v":""},{"$f":"IF(ISBLANK('Data Input'!A230),\"\",SUM('Data Input'!P230,'Data Input'!V230,'Data Input'!W230))","v":""},{"$f":"IF(M225=\"\",\"\",M225/COUNTIF('Data Input'!$C$8:$AA$8,\"÷\"))","v":""},{"$f":"IF(ISBLANK('Data Input'!A230),\"\",SUM('Data Input'!T230,'Data Input'!X230,'Data Input'!Z230,'Data Input'!AA230))","v":""},{"$f":"IF(O225=\"\",\"\",O225/COUNTIF('Data Input'!$C$8:$AA$8,\"F\"))","v":""}]
[{"$f":"IF('Data Input'!A231=0,\"\",'Data Input'!A231)","v":""},{"$f":"IF(ISBLANK('Data Input'!A231),\"\",COUNTIF('Data Input'!C231:AA231,\"\"))","v":""},{"$f":"IF(ISBLANK('Data Input'!A231),\"\",COUNTIF('Data Input'!C231:AA231,\"0\"))","v":""},{"$f":"IF(ISBLANK('Data Input'!A231),\"\",SUM(B226,C226))","v":""},{"$f":"IF(ISBLANK('Data Input'!A231),\"\",SUM('Data Input'!C231:AA231))","v":""},{"$f":"IF(E226=\"\",\"\",E226/(COUNTA('Data Input'!$C$8:$AA$8)))","v":""},{"$f":"IF(ISBLANK('Data Input'!A231),\"\",SUM('Data Input'!C231,'Data Input'!F231,'Data Input'!G231,'Data Input'!J231,'Data Input'!L231,'Data Input'!O231,'Data Input'!Q231,'Data Input'!R231,'Data Input'!U231))","v":""},{"$f":"IF(G226=\"\",\"\",G226/COUNTIF('Data Input'!$C$8:$AA$8,\"+\"))","v":""},{"$f":"IF(ISBLANK('Data Input'!A231),\"\",SUM('Data Input'!D231,'Data Input'!E231,'Data Input'!K231,'Data Input'!M231,'Data Input'!Y231))","v":""},{"$f":"IF(I226=\"\",\"\",I226/COUNTIF('Data Input'!$C$8:$AA$8,\"-\"))","v":""},{"$f":"IF(ISBLANK('Data Input'!A231),\"\",SUM('Data Input'!H231,'Data Input'!I231,'Data Input'!N231,'Data Input'!S231))","v":""},{"$f":"IF(K226=\"\",\"\",K226/COUNTIF('Data Input'!$C$8:$AA$8,\"x\"))","v":""},{"$f":"IF(ISBLANK('Data Input'!A231),\"\",SUM('Data Input'!P231,'Data Input'!V231,'Data Input'!W231))","v":""},{"$f":"IF(M226=\"\",\"\",M226/COUNTIF('Data Input'!$C$8:$AA$8,\"÷\"))","v":""},{"$f":"IF(ISBLANK('Data Input'!A231),\"\",SUM('Data Input'!T231,'Data Input'!X231,'Data Input'!Z231,'Data Input'!AA231))","v":""},{"$f":"IF(O226=\"\",\"\",O226/COUNTIF('Data Input'!$C$8:$AA$8,\"F\"))","v":""}]
[{"$f":"IF('Data Input'!A232=0,\"\",'Data Input'!A232)","v":""},{"$f":"IF(ISBLANK('Data Input'!A232),\"\",COUNTIF('Data Input'!C232:AA232,\"\"))","v":""},{"$f":"IF(ISBLANK('Data Input'!A232),\"\",COUNTIF('Data Input'!C232:AA232,\"0\"))","v":""},{"$f":"IF(ISBLANK('Data Input'!A232),\"\",SUM(B227,C227))","v":""},{"$f":"IF(ISBLANK('Data Input'!A232),\"\",SUM('Data Input'!C232:AA232))","v":""},{"$f":"IF(E227=\"\",\"\",E227/(COUNTA('Data Input'!$C$8:$AA$8)))","v":""},{"$f":"IF(ISBLANK('Data Input'!A232),\"\",SUM('Data Input'!C232,'Data Input'!F232,'Data Input'!G232,'Data Input'!J232,'Data Input'!L232,'Data Input'!O232,'Data Input'!Q232,'Data Input'!R232,'Data Input'!U232))","v":""},{"$f":"IF(G227=\"\",\"\",G227/COUNTIF('Data Input'!$C$8:$AA$8,\"+\"))","v":""},{"$f":"IF(ISBLANK('Data Input'!A232),\"\",SUM('Data Input'!D232,'Data Input'!E232,'Data Input'!K232,'Data Input'!M232,'Data Input'!Y232))","v":""},{"$f":"IF(I227=\"\",\"\",I227/COUNTIF('Data Input'!$C$8:$AA$8,\"-\"))","v":""},{"$f":"IF(ISBLANK('Data Input'!A232),\"\",SUM('Data Input'!H232,'Data Input'!I232,'Data Input'!N232,'Data Input'!S232))","v":""},{"$f":"IF(K227=\"\",\"\",K227/COUNTIF('Data Input'!$C$8:$AA$8,\"x\"))","v":""},{"$f":"IF(ISBLANK('Data Input'!A232),\"\",SUM('Data Input'!P232,'Data Input'!V232,'Data Input'!W232))","v":""},{"$f":"IF(M227=\"\",\"\",M227/COUNTIF('Data Input'!$C$8:$AA$8,\"÷\"))","v":""},{"$f":"IF(ISBLANK('Data Input'!A232),\"\",SUM('Data Input'!T232,'Data Input'!X232,'Data Input'!Z232,'Data Input'!AA232))","v":""},{"$f":"IF(O227=\"\",\"\",O227/COUNTIF('Data Input'!$C$8:$AA$8,\"F\"))","v":""}]
[{"$f":"IF('Data Input'!A233=0,\"\",'Data Input'!A233)","v":""},{"$f":"IF(ISBLANK('Data Input'!A233),\"\",COUNTIF('Data Input'!C233:AA233,\"\"))","v":""},{"$f":"IF(ISBLANK('Data Input'!A233),\"\",COUNTIF('Data Input'!C233:AA233,\"0\"))","v":""},{"$f":"IF(ISBLANK('Data Input'!A233),\"\",SUM(B228,C228))","v":""},{"$f":"IF(ISBLANK('Data Input'!A233),\"\",SUM('Data Input'!C233:AA233))","v":""},{"$f":"IF(E228=\"\",\"\",E228/(COUNTA('Data Input'!$C$8:$AA$8)))","v":""},{"$f":"IF(ISBLANK('Data Input'!A233),\"\",SUM('Data Input'!C233,'Data Input'!F233,'Data Input'!G233,'Data Input'!J233,'Data Input'!L233,'Data Input'!O233,'Data Input'!Q233,'Data Input'!R233,'Data Input'!U233))","v":""},{"$f":"IF(G228=\"\",\"\",G228/COUNTIF('Data Input'!$C$8:$AA$8,\"+\"))","v":""},{"$f":"IF(ISBLANK('Data Input'!A233),\"\",SUM('Data Input'!D233,'Data Input'!E233,'Data Input'!K233,'Data Input'!M233,'Data Input'!Y233))","v":""},{"$f":"IF(I228=\"\",\"\",I228/COUNTIF('Data Input'!$C$8:$AA$8,\"-\"))","v":""},{"$f":"IF(ISBLANK('Data Input'!A233),\"\",SUM('Data Input'!H233,'Data Input'!I233,'Data Input'!N233,'Data Input'!S233))","v":""},{"$f":"IF(K228=\"\",\"\",K228/COUNTIF('Data Input'!$C$8:$AA$8,\"x\"))","v":""},{"$f":"IF(ISBLANK('Data Input'!A233),\"\",SUM('Data Input'!P233,'Data Input'!V233,'Data Input'!W233))","v":""},{"$f":"IF(M228=\"\",\"\",M228/COUNTIF('Data Input'!$C$8:$AA$8,\"÷\"))","v":""},{"$f":"IF(ISBLANK('Data Input'!A233),\"\",SUM('Data Input'!T233,'Data Input'!X233,'Data Input'!Z233,'Data Input'!AA233))","v":""},{"$f":"IF(O228=\"\",\"\",O228/COUNTIF('Data Input'!$C$8:$AA$8,\"F\"))","v":""}]
[{"$f":"IF('Data Input'!A234=0,\"\",'Data Input'!A234)","v":""},{"$f":"IF(ISBLANK('Data Input'!A234),\"\",COUNTIF('Data Input'!C234:AA234,\"\"))","v":""},{"$f":"IF(ISBLANK('Data Input'!A234),\"\",COUNTIF('Data Input'!C234:AA234,\"0\"))","v":""},{"$f":"IF(ISBLANK('Data Input'!A234),\"\",SUM(B229,C229))","v":""},{"$f":"IF(ISBLANK('Data Input'!A234),\"\",SUM('Data Input'!C234:AA234))","v":""},{"$f":"IF(E229=\"\",\"\",E229/(COUNTA('Data Input'!$C$8:$AA$8)))","v":""},{"$f":"IF(ISBLANK('Data Input'!A234),\"\",SUM('Data Input'!C234,'Data Input'!F234,'Data Input'!G234,'Data Input'!J234,'Data Input'!L234,'Data Input'!O234,'Data Input'!Q234,'Data Input'!R234,'Data Input'!U234))","v":""},{"$f":"IF(G229=\"\",\"\",G229/COUNTIF('Data Input'!$C$8:$AA$8,\"+\"))","v":""},{"$f":"IF(ISBLANK('Data Input'!A234),\"\",SUM('Data Input'!D234,'Data Input'!E234,'Data Input'!K234,'Data Input'!M234,'Data Input'!Y234))","v":""},{"$f":"IF(I229=\"\",\"\",I229/COUNTIF('Data Input'!$C$8:$AA$8,\"-\"))","v":""},{"$f":"IF(ISBLANK('Data Input'!A234),\"\",SUM('Data Input'!H234,'Data Input'!I234,'Data Input'!N234,'Data Input'!S234))","v":""},{"$f":"IF(K229=\"\",\"\",K229/COUNTIF('Data Input'!$C$8:$AA$8,\"x\"))","v":""},{"$f":"IF(ISBLANK('Data Input'!A234),\"\",SUM('Data Input'!P234,'Data Input'!V234,'Data Input'!W234))","v":""},{"$f":"IF(M229=\"\",\"\",M229/COUNTIF('Data Input'!$C$8:$AA$8,\"÷\"))","v":""},{"$f":"IF(ISBLANK('Data Input'!A234),\"\",SUM('Data Input'!T234,'Data Input'!X234,'Data Input'!Z234,'Data Input'!AA234))","v":""},{"$f":"IF(O229=\"\",\"\",O229/COUNTIF('Data Input'!$C$8:$AA$8,\"F\"))","v":""}]
[{"$f":"IF('Data Input'!A235=0,\"\",'Data Input'!A235)","v":""},{"$f":"IF(ISBLANK('Data Input'!A235),\"\",COUNTIF('Data Input'!C235:AA235,\"\"))","v":""},{"$f":"IF(ISBLANK('Data Input'!A235),\"\",COUNTIF('Data Input'!C235:AA235,\"0\"))","v":""},{"$f":"IF(ISBLANK('Data Input'!A235),\"\",SUM(B230,C230))","v":""},{"$f":"IF(ISBLANK('Data Input'!A235),\"\",SUM('Data Input'!C235:AA235))","v":""},{"$f":"IF(E230=\"\",\"\",E230/(COUNTA('Data Input'!$C$8:$AA$8)))","v":""},{"$f":"IF(ISBLANK('Data Input'!A235),\"\",SUM('Data Input'!C235,'Data Input'!F235,'Data Input'!G235,'Data Input'!J235,'Data Input'!L235,'Data Input'!O235,'Data Input'!Q235,'Data Input'!R235,'Data Input'!U235))","v":""},{"$f":"IF(G230=\"\",\"\",G230/COUNTIF('Data Input'!$C$8:$AA$8,\"+\"))","v":""},{"$f":"IF(ISBLANK('Data Input'!A235),\"\",SUM('Data Input'!D235,'Data Input'!E235,'Data Input'!K235,'Data Input'!M235,'Data Input'!Y235))","v":""},{"$f":"IF(I230=\"\",\"\",I230/COUNTIF('Data Input'!$C$8:$AA$8,\"-\"))","v":""},{"$f":"IF(ISBLANK('Data Input'!A235),\"\",SUM('Data Input'!H235,'Data Input'!I235,'Data Input'!N235,'Data Input'!S235))","v":""},{"$f":"IF(K230=\"\",\"\",K230/COUNTIF('Data Input'!$C$8:$AA$8,\"x\"))","v":""},{"$f":"IF(ISBLANK('Data Input'!A235),\"\",SUM('Data Input'!P235,'Data Input'!V235,'Data Input'!W235))","v":""},{"$f":"IF(M230=\"\",\"\",M230/COUNTIF('Data Input'!$C$8:$AA$8,\"÷\"))","v":""},{"$f":"IF(ISBLANK('Data Input'!A235),\"\",SUM('Data Input'!T235,'Data Input'!X235,'Data Input'!Z235,'Data Input'!AA235))","v":""},{"$f":"IF(O230=\"\",\"\",O230/COUNTIF('Data Input'!$C$8:$AA$8,\"F\"))","v":""}]
[{"$f":"IF('Data Input'!A236=0,\"\",'Data Input'!A236)","v":""},{"$f":"IF(ISBLANK('Data Input'!A236),\"\",COUNTIF('Data Input'!C236:AA236,\"\"))","v":""},{"$f":"IF(ISBLANK('Data Input'!A236),\"\",COUNTIF('Data Input'!C236:AA236,\"0\"))","v":""},{"$f":"IF(ISBLANK('Data Input'!A236),\"\",SUM(B231,C231))","v":""},{"$f":"IF(ISBLANK('Data Input'!A236),\"\",SUM('Data Input'!C236:AA236))","v":""},{"$f":"IF(E231=\"\",\"\",E231/(COUNTA('Data Input'!$C$8:$AA$8)))","v":""},{"$f":"IF(ISBLANK('Data Input'!A236),\"\",SUM('Data Input'!C236,'Data Input'!F236,'Data Input'!G236,'Data Input'!J236,'Data Input'!L236,'Data Input'!O236,'Data Input'!Q236,'Data Input'!R236,'Data Input'!U236))","v":""},{"$f":"IF(G231=\"\",\"\",G231/COUNTIF('Data Input'!$C$8:$AA$8,\"+\"))","v":""},{"$f":"IF(ISBLANK('Data Input'!A236),\"\",SUM('Data Input'!D236,'Data Input'!E236,'Data Input'!K236,'Data Input'!M236,'Data Input'!Y236))","v":""},{"$f":"IF(I231=\"\",\"\",I231/COUNTIF('Data Input'!$C$8:$AA$8,\"-\"))","v":""},{"$f":"IF(ISBLANK('Data Input'!A236),\"\",SUM('Data Input'!H236,'Data Input'!I236,'Data Input'!N236,'Data Input'!S236))","v":""},{"$f":"IF(K231=\"\",\"\",K231/COUNTIF('Data Input'!$C$8:$AA$8,\"x\"))","v":""},{"$f":"IF(ISBLANK('Data Input'!A236),\"\",SUM('Data Input'!P236,'Data Input'!V236,'Data Input'!W236))","v":""},{"$f":"IF(M231=\"\",\"\",M231/COUNTIF('Data Input'!$C$8:$AA$8,\"÷\"))","v":""},{"$f":"IF(ISBLANK('Data Input'!A236),\"\",SUM('Data Input'!T236,'Data Input'!X236,'Data Input'!Z236,'Data Input'!AA236))","v":""},{"$f":"IF(O231=\"\",\"\",O231/COUNTIF('Data Input'!$C$8:$AA$8,\"F\"))","v":""}]
[{"$f":"IF('Data Input'!A237=0,\"\",'Data Input'!A237)","v":""},{"$f":"IF(ISBLANK('Data Input'!A237),\"\",COUNTIF('Data Input'!C237:AA237,\"\"))","v":""},{"$f":"IF(ISBLANK('Data Input'!A237),\"\",COUNTIF('Data Input'!C237:AA237,\"0\"))","v":""},{"$f":"IF(ISBLANK('Data Input'!A237),\"\",SUM(B232,C232))","v":""},{"$f":"IF(ISBLANK('Data Input'!A237),\"\",SUM('Data Input'!C237:AA237))","v":""},{"$f":"IF(E232=\"\",\"\",E232/(COUNTA('Data Input'!$C$8:$AA$8)))","v":""},{"$f":"IF(ISBLANK('Data Input'!A237),\"\",SUM('Data Input'!C237,'Data Input'!F237,'Data Input'!G237,'Data Input'!J237,'Data Input'!L237,'Data Input'!O237,'Data Input'!Q237,'Data Input'!R237,'Data Input'!U237))","v":""},{"$f":"IF(G232=\"\",\"\",G232/COUNTIF('Data Input'!$C$8:$AA$8,\"+\"))","v":""},{"$f":"IF(ISBLANK('Data Input'!A237),\"\",SUM('Data Input'!D237,'Data Input'!E237,'Data Input'!K237,'Data Input'!M237,'Data Input'!Y237))","v":""},{"$f":"IF(I232=\"\",\"\",I232/COUNTIF('Data Input'!$C$8:$AA$8,\"-\"))","v":""},{"$f":"IF(ISBLANK('Data Input'!A237),\"\",SUM('Data Input'!H237,'Data Input'!I237,'Data Input'!N237,'Data Input'!S237))","v":""},{"$f":"IF(K232=\"\",\"\",K232/COUNTIF('Data Input'!$C$8:$AA$8,\"x\"))","v":""},{"$f":"IF(ISBLANK('Data Input'!A237),\"\",SUM('Data Input'!P237,'Data Input'!V237,'Data Input'!W237))","v":""},{"$f":"IF(M232=\"\",\"\",M232/COUNTIF('Data Input'!$C$8:$AA$8,\"÷\"))","v":""},{"$f":"IF(ISBLANK('Data Input'!A237),\"\",SUM('Data Input'!T237,'Data Input'!X237,'Data Input'!Z237,'Data Input'!AA237))","v":""},{"$f":"IF(O232=\"\",\"\",O232/COUNTIF('Data Input'!$C$8:$AA$8,\"F\"))","v":""}]
[{"$f":"IF('Data Input'!A238=0,\"\",'Data Input'!A238)","v":""},{"$f":"IF(ISBLANK('Data Input'!A238),\"\",COUNTIF('Data Input'!C238:AA238,\"\"))","v":""},{"$f":"IF(ISBLANK('Data Input'!A238),\"\",COUNTIF('Data Input'!C238:AA238,\"0\"))","v":""},{"$f":"IF(ISBLANK('Data Input'!A238),\"\",SUM(B233,C233))","v":""},{"$f":"IF(ISBLANK('Data Input'!A238),\"\",SUM('Data Input'!C238:AA238))","v":""},{"$f":"IF(E233=\"\",\"\",E233/(COUNTA('Data Input'!$C$8:$AA$8)))","v":""},{"$f":"IF(ISBLANK('Data Input'!A238),\"\",SUM('Data Input'!C238,'Data Input'!F238,'Data Input'!G238,'Data Input'!J238,'Data Input'!L238,'Data Input'!O238,'Data Input'!Q238,'Data Input'!R238,'Data Input'!U238))","v":""},{"$f":"IF(G233=\"\",\"\",G233/COUNTIF('Data Input'!$C$8:$AA$8,\"+\"))","v":""},{"$f":"IF(ISBLANK('Data Input'!A238),\"\",SUM('Data Input'!D238,'Data Input'!E238,'Data Input'!K238,'Data Input'!M238,'Data Input'!Y238))","v":""},{"$f":"IF(I233=\"\",\"\",I233/COUNTIF('Data Input'!$C$8:$AA$8,\"-\"))","v":""},{"$f":"IF(ISBLANK('Data Input'!A238),\"\",SUM('Data Input'!H238,'Data Input'!I238,'Data Input'!N238,'Data Input'!S238))","v":""},{"$f":"IF(K233=\"\",\"\",K233/COUNTIF('Data Input'!$C$8:$AA$8,\"x\"))","v":""},{"$f":"IF(ISBLANK('Data Input'!A238),\"\",SUM('Data Input'!P238,'Data Input'!V238,'Data Input'!W238))","v":""},{"$f":"IF(M233=\"\",\"\",M233/COUNTIF('Data Input'!$C$8:$AA$8,\"÷\"))","v":""},{"$f":"IF(ISBLANK('Data Input'!A238),\"\",SUM('Data Input'!T238,'Data Input'!X238,'Data Input'!Z238,'Data Input'!AA238))","v":""},{"$f":"IF(O233=\"\",\"\",O233/COUNTIF('Data Input'!$C$8:$AA$8,\"F\"))","v":""}]
[{"$f":"IF('Data Input'!A239=0,\"\",'Data Input'!A239)","v":""},{"$f":"IF(ISBLANK('Data Input'!A239),\"\",COUNTIF('Data Input'!C239:AA239,\"\"))","v":""},{"$f":"IF(ISBLANK('Data Input'!A239),\"\",COUNTIF('Data Input'!C239:AA239,\"0\"))","v":""},{"$f":"IF(ISBLANK('Data Input'!A239),\"\",SUM(B234,C234))","v":""},{"$f":"IF(ISBLANK('Data Input'!A239),\"\",SUM('Data Input'!C239:AA239))","v":""},{"$f":"IF(E234=\"\",\"\",E234/(COUNTA('Data Input'!$C$8:$AA$8)))","v":""},{"$f":"IF(ISBLANK('Data Input'!A239),\"\",SUM('Data Input'!C239,'Data Input'!F239,'Data Input'!G239,'Data Input'!J239,'Data Input'!L239,'Data Input'!O239,'Data Input'!Q239,'Data Input'!R239,'Data Input'!U239))","v":""},{"$f":"IF(G234=\"\",\"\",G234/COUNTIF('Data Input'!$C$8:$AA$8,\"+\"))","v":""},{"$f":"IF(ISBLANK('Data Input'!A239),\"\",SUM('Data Input'!D239,'Data Input'!E239,'Data Input'!K239,'Data Input'!M239,'Data Input'!Y239))","v":""},{"$f":"IF(I234=\"\",\"\",I234/COUNTIF('Data Input'!$C$8:$AA$8,\"-\"))","v":""},{"$f":"IF(ISBLANK('Data Input'!A239),\"\",SUM('Data Input'!H239,'Data Input'!I239,'Data Input'!N239,'Data Input'!S239))","v":""},{"$f":"IF(K234=\"\",\"\",K234/COUNTIF('Data Input'!$C$8:$AA$8,\"x\"))","v":""},{"$f":"IF(ISBLANK('Data Input'!A239),\"\",SUM('Data Input'!P239,'Data Input'!V239,'Data Input'!W239))","v":""},{"$f":"IF(M234=\"\",\"\",M234/COUNTIF('Data Input'!$C$8:$AA$8,\"÷\"))","v":""},{"$f":"IF(ISBLANK('Data Input'!A239),\"\",SUM('Data Input'!T239,'Data Input'!X239,'Data Input'!Z239,'Data Input'!AA239))","v":""},{"$f":"IF(O234=\"\",\"\",O234/COUNTIF('Data Input'!$C$8:$AA$8,\"F\"))","v":""}]
[{"$f":"IF('Data Input'!A240=0,\"\",'Data Input'!A240)","v":""},{"$f":"IF(ISBLANK('Data Input'!A240),\"\",COUNTIF('Data Input'!C240:AA240,\"\"))","v":""},{"$f":"IF(ISBLANK('Data Input'!A240),\"\",COUNTIF('Data Input'!C240:AA240,\"0\"))","v":""},{"$f":"IF(ISBLANK('Data Input'!A240),\"\",SUM(B235,C235))","v":""},{"$f":"IF(ISBLANK('Data Input'!A240),\"\",SUM('Data Input'!C240:AA240))","v":""},{"$f":"IF(E235=\"\",\"\",E235/(COUNTA('Data Input'!$C$8:$AA$8)))","v":""},{"$f":"IF(ISBLANK('Data Input'!A240),\"\",SUM('Data Input'!C240,'Data Input'!F240,'Data Input'!G240,'Data Input'!J240,'Data Input'!L240,'Data Input'!O240,'Data Input'!Q240,'Data Input'!R240,'Data Input'!U240))","v":""},{"$f":"IF(G235=\"\",\"\",G235/COUNTIF('Data Input'!$C$8:$AA$8,\"+\"))","v":""},{"$f":"IF(ISBLANK('Data Input'!A240),\"\",SUM('Data Input'!D240,'Data Input'!E240,'Data Input'!K240,'Data Input'!M240,'Data Input'!Y240))","v":""},{"$f":"IF(I235=\"\",\"\",I235/COUNTIF('Data Input'!$C$8:$AA$8,\"-\"))","v":""},{"$f":"IF(ISBLANK('Data Input'!A240),\"\",SUM('Data Input'!H240,'Data Input'!I240,'Data Input'!N240,'Data Input'!S240))","v":""},{"$f":"IF(K235=\"\",\"\",K235/COUNTIF('Data Input'!$C$8:$AA$8,\"x\"))","v":""},{"$f":"IF(ISBLANK('Data Input'!A240),\"\",SUM('Data Input'!P240,'Data Input'!V240,'Data Input'!W240))","v":""},{"$f":"IF(M235=\"\",\"\",M235/COUNTIF('Data Input'!$C$8:$AA$8,\"÷\"))","v":""},{"$f":"IF(ISBLANK('Data Input'!A240),\"\",SUM('Data Input'!T240,'Data Input'!X240,'Data Input'!Z240,'Data Input'!AA240))","v":""},{"$f":"IF(O235=\"\",\"\",O235/COUNTIF('Data Input'!$C$8:$AA$8,\"F\"))","v":""}]
[{"$f":"IF('Data Input'!A241=0,\"\",'Data Input'!A241)","v":""},{"$f":"IF(ISBLANK('Data Input'!A241),\"\",COUNTIF('Data Input'!C241:AA241,\"\"))","v":""},{"$f":"IF(ISBLANK('Data Input'!A241),\"\",COUNTIF('Data Input'!C241:AA241,\"0\"))","v":""},{"$f":"IF(ISBLANK('Data Input'!A241),\"\",SUM(B236,C236))","v":""},{"$f":"IF(ISBLANK('Data Input'!A241),\"\",SUM('Data Input'!C241:AA241))","v":""},{"$f":"IF(E236=\"\",\"\",E236/(COUNTA('Data Input'!$C$8:$AA$8)))","v":""},{"$f":"IF(ISBLANK('Data Input'!A241),\"\",SUM('Data Input'!C241,'Data Input'!F241,'Data Input'!G241,'Data Input'!J241,'Data Input'!L241,'Data Input'!O241,'Data Input'!Q241,'Data Input'!R241,'Data Input'!U241))","v":""},{"$f":"IF(G236=\"\",\"\",G236/COUNTIF('Data Input'!$C$8:$AA$8,\"+\"))","v":""},{"$f":"IF(ISBLANK('Data Input'!A241),\"\",SUM('Data Input'!D241,'Data Input'!E241,'Data Input'!K241,'Data Input'!M241,'Data Input'!Y241))","v":""},{"$f":"IF(I236=\"\",\"\",I236/COUNTIF('Data Input'!$C$8:$AA$8,\"-\"))","v":""},{"$f":"IF(ISBLANK('Data Input'!A241),\"\",SUM('Data Input'!H241,'Data Input'!I241,'Data Input'!N241,'Data Input'!S241))","v":""},{"$f":"IF(K236=\"\",\"\",K236/COUNTIF('Data Input'!$C$8:$AA$8,\"x\"))","v":""},{"$f":"IF(ISBLANK('Data Input'!A241),\"\",SUM('Data Input'!P241,'Data Input'!V241,'Data Input'!W241))","v":""},{"$f":"IF(M236=\"\",\"\",M236/COUNTIF('Data Input'!$C$8:$AA$8,\"÷\"))","v":""},{"$f":"IF(ISBLANK('Data Input'!A241),\"\",SUM('Data Input'!T241,'Data Input'!X241,'Data Input'!Z241,'Data Input'!AA241))","v":""},{"$f":"IF(O236=\"\",\"\",O236/COUNTIF('Data Input'!$C$8:$AA$8,\"F\"))","v":""}]
[{"$f":"IF('Data Input'!A242=0,\"\",'Data Input'!A242)","v":""},{"$f":"IF(ISBLANK('Data Input'!A242),\"\",COUNTIF('Data Input'!C242:AA242,\"\"))","v":""},{"$f":"IF(ISBLANK('Data Input'!A242),\"\",COUNTIF('Data Input'!C242:AA242,\"0\"))","v":""},{"$f":"IF(ISBLANK('Data Input'!A242),\"\",SUM(B237,C237))","v":""},{"$f":"IF(ISBLANK('Data Input'!A242),\"\",SUM('Data Input'!C242:AA242))","v":""},{"$f":"IF(E237=\"\",\"\",E237/(COUNTA('Data Input'!$C$8:$AA$8)))","v":""},{"$f":"IF(ISBLANK('Data Input'!A242),\"\",SUM('Data Input'!C242,'Data Input'!F242,'Data Input'!G242,'Data Input'!J242,'Data Input'!L242,'Data Input'!O242,'Data Input'!Q242,'Data Input'!R242,'Data Input'!U242))","v":""},{"$f":"IF(G237=\"\",\"\",G237/COUNTIF('Data Input'!$C$8:$AA$8,\"+\"))","v":""},{"$f":"IF(ISBLANK('Data Input'!A242),\"\",SUM('Data Input'!D242,'Data Input'!E242,'Data Input'!K242,'Data Input'!M242,'Data Input'!Y242))","v":""},{"$f":"IF(I237=\"\",\"\",I237/COUNTIF('Data Input'!$C$8:$AA$8,\"-\"))","v":""},{"$f":"IF(ISBLANK('Data Input'!A242),\"\",SUM('Data Input'!H242,'Data Input'!I242,'Data Input'!N242,'Data Input'!S242))","v":""},{"$f":"IF(K237=\"\",\"\",K237/COUNTIF('Data Input'!$C$8:$AA$8,\"x\"))","v":""},{"$f":"IF(ISBLANK('Data Input'!A242),\"\",SUM('Data Input'!P242,'Data Input'!V242,'Data Input'!W242))","v":""},{"$f":"IF(M237=\"\",\"\",M237/COUNTIF('Data Input'!$C$8:$AA$8,\"÷\"))","v":""},{"$f":"IF(ISBLANK('Data Input'!A242),\"\",SUM('Data Input'!T242,'Data Input'!X242,'Data Input'!Z242,'Data Input'!AA242))","v":""},{"$f":"IF(O237=\"\",\"\",O237/COUNTIF('Data Input'!$C$8:$AA$8,\"F\"))","v":""}]
[{"$f":"IF('Data Input'!A243=0,\"\",'Data Input'!A243)","v":""},{"$f":"IF(ISBLANK('Data Input'!A243),\"\",COUNTIF('Data Input'!C243:AA243,\"\"))","v":""},{"$f":"IF(ISBLANK('Data Input'!A243),\"\",COUNTIF('Data Input'!C243:AA243,\"0\"))","v":""},{"$f":"IF(ISBLANK('Data Input'!A243),\"\",SUM(B238,C238))","v":""},{"$f":"IF(ISBLANK('Data Input'!A243),\"\",SUM('Data Input'!C243:AA243))","v":""},{"$f":"IF(E238=\"\",\"\",E238/(COUNTA('Data Input'!$C$8:$AA$8)))","v":""},{"$f":"IF(ISBLANK('Data Input'!A243),\"\",SUM('Data Input'!C243,'Data Input'!F243,'Data Input'!G243,'Data Input'!J243,'Data Input'!L243,'Data Input'!O243,'Data Input'!Q243,'Data Input'!R243,'Data Input'!U243))","v":""},{"$f":"IF(G238=\"\",\"\",G238/COUNTIF('Data Input'!$C$8:$AA$8,\"+\"))","v":""},{"$f":"IF(ISBLANK('Data Input'!A243),\"\",SUM('Data Input'!D243,'Data Input'!E243,'Data Input'!K243,'Data Input'!M243,'Data Input'!Y243))","v":""},{"$f":"IF(I238=\"\",\"\",I238/COUNTIF('Data Input'!$C$8:$AA$8,\"-\"))","v":""},{"$f":"IF(ISBLANK('Data Input'!A243),\"\",SUM('Data Input'!H243,'Data Input'!I243,'Data Input'!N243,'Data Input'!S243))","v":""},{"$f":"IF(K238=\"\",\"\",K238/COUNTIF('Data Input'!$C$8:$AA$8,\"x\"))","v":""},{"$f":"IF(ISBLANK('Data Input'!A243),\"\",SUM('Data Input'!P243,'Data Input'!V243,'Data Input'!W243))","v":""},{"$f":"IF(M238=\"\",\"\",M238/COUNTIF('Data Input'!$C$8:$AA$8,\"÷\"))","v":""},{"$f":"IF(ISBLANK('Data Input'!A243),\"\",SUM('Data Input'!T243,'Data Input'!X243,'Data Input'!Z243,'Data Input'!AA243))","v":""},{"$f":"IF(O238=\"\",\"\",O238/COUNTIF('Data Input'!$C$8:$AA$8,\"F\"))","v":""}]
[{"$f":"IF('Data Input'!A244=0,\"\",'Data Input'!A244)","v":""},{"$f":"IF(ISBLANK('Data Input'!A244),\"\",COUNTIF('Data Input'!C244:AA244,\"\"))","v":""},{"$f":"IF(ISBLANK('Data Input'!A244),\"\",COUNTIF('Data Input'!C244:AA244,\"0\"))","v":""},{"$f":"IF(ISBLANK('Data Input'!A244),\"\",SUM(B239,C239))","v":""},{"$f":"IF(ISBLANK('Data Input'!A244),\"\",SUM('Data Input'!C244:AA244))","v":""},{"$f":"IF(E239=\"\",\"\",E239/(COUNTA('Data Input'!$C$8:$AA$8)))","v":""},{"$f":"IF(ISBLANK('Data Input'!A244),\"\",SUM('Data Input'!C244,'Data Input'!F244,'Data Input'!G244,'Data Input'!J244,'Data Input'!L244,'Data Input'!O244,'Data Input'!Q244,'Data Input'!R244,'Data Input'!U244))","v":""},{"$f":"IF(G239=\"\",\"\",G239/COUNTIF('Data Input'!$C$8:$AA$8,\"+\"))","v":""},{"$f":"IF(ISBLANK('Data Input'!A244),\"\",SUM('Data Input'!D244,'Data Input'!E244,'Data Input'!K244,'Data Input'!M244,'Data Input'!Y244))","v":""},{"$f":"IF(I239=\"\",\"\",I239/COUNTIF('Data Input'!$C$8:$AA$8,\"-\"))","v":""},{"$f":"IF(ISBLANK('Data Input'!A244),\"\",SUM('Data Input'!H244,'Data Input'!I244,'Data Input'!N244,'Data Input'!S244))","v":""},{"$f":"IF(K239=\"\",\"\",K239/COUNTIF('Data Input'!$C$8:$AA$8,\"x\"))","v":""},{"$f":"IF(ISBLANK('Data Input'!A244),\"\",SUM('Data Input'!P244,'Data Input'!V244,'Data Input'!W244))","v":""},{"$f":"IF(M239=\"\",\"\",M239/COUNTIF('Data Input'!$C$8:$AA$8,\"÷\"))","v":""},{"$f":"IF(ISBLANK('Data Input'!A244),\"\",SUM('Data Input'!T244,'Data Input'!X244,'Data Input'!Z244,'Data Input'!AA244))","v":""},{"$f":"IF(O239=\"\",\"\",O239/COUNTIF('Data Input'!$C$8:$AA$8,\"F\"))","v":""}]
[{"$f":"IF('Data Input'!A245=0,\"\",'Data Input'!A245)","v":""},{"$f":"IF(ISBLANK('Data Input'!A245),\"\",COUNTIF('Data Input'!C245:AA245,\"\"))","v":""},{"$f":"IF(ISBLANK('Data Input'!A245),\"\",COUNTIF('Data Input'!C245:AA245,\"0\"))","v":""},{"$f":"IF(ISBLANK('Data Input'!A245),\"\",SUM(B240,C240))","v":""},{"$f":"IF(ISBLANK('Data Input'!A245),\"\",SUM('Data Input'!C245:AA245))","v":""},{"$f":"IF(E240=\"\",\"\",E240/(COUNTA('Data Input'!$C$8:$AA$8)))","v":""},{"$f":"IF(ISBLANK('Data Input'!A245),\"\",SUM('Data Input'!C245,'Data Input'!F245,'Data Input'!G245,'Data Input'!J245,'Data Input'!L245,'Data Input'!O245,'Data Input'!Q245,'Data Input'!R245,'Data Input'!U245))","v":""},{"$f":"IF(G240=\"\",\"\",G240/COUNTIF('Data Input'!$C$8:$AA$8,\"+\"))","v":""},{"$f":"IF(ISBLANK('Data Input'!A245),\"\",SUM('Data Input'!D245,'Data Input'!E245,'Data Input'!K245,'Data Input'!M245,'Data Input'!Y245))","v":""},{"$f":"IF(I240=\"\",\"\",I240/COUNTIF('Data Input'!$C$8:$AA$8,\"-\"))","v":""},{"$f":"IF(ISBLANK('Data Input'!A245),\"\",SUM('Data Input'!H245,'Data Input'!I245,'Data Input'!N245,'Data Input'!S245))","v":""},{"$f":"IF(K240=\"\",\"\",K240/COUNTIF('Data Input'!$C$8:$AA$8,\"x\"))","v":""},{"$f":"IF(ISBLANK('Data Input'!A245),\"\",SUM('Data Input'!P245,'Data Input'!V245,'Data Input'!W245))","v":""},{"$f":"IF(M240=\"\",\"\",M240/COUNTIF('Data Input'!$C$8:$AA$8,\"÷\"))","v":""},{"$f":"IF(ISBLANK('Data Input'!A245),\"\",SUM('Data Input'!T245,'Data Input'!X245,'Data Input'!Z245,'Data Input'!AA245))","v":""},{"$f":"IF(O240=\"\",\"\",O240/COUNTIF('Data Input'!$C$8:$AA$8,\"F\"))","v":""}]
[{"$f":"IF('Data Input'!A246=0,\"\",'Data Input'!A246)","v":""},{"$f":"IF(ISBLANK('Data Input'!A246),\"\",COUNTIF('Data Input'!C246:AA246,\"\"))","v":""},{"$f":"IF(ISBLANK('Data Input'!A246),\"\",COUNTIF('Data Input'!C246:AA246,\"0\"))","v":""},{"$f":"IF(ISBLANK('Data Input'!A246),\"\",SUM(B241,C241))","v":""},{"$f":"IF(ISBLANK('Data Input'!A246),\"\",SUM('Data Input'!C246:AA246))","v":""},{"$f":"IF(E241=\"\",\"\",E241/(COUNTA('Data Input'!$C$8:$AA$8)))","v":""},{"$f":"IF(ISBLANK('Data Input'!A246),\"\",SUM('Data Input'!C246,'Data Input'!F246,'Data Input'!G246,'Data Input'!J246,'Data Input'!L246,'Data Input'!O246,'Data Input'!Q246,'Data Input'!R246,'Data Input'!U246))","v":""},{"$f":"IF(G241=\"\",\"\",G241/COUNTIF('Data Input'!$C$8:$AA$8,\"+\"))","v":""},{"$f":"IF(ISBLANK('Data Input'!A246),\"\",SUM('Data Input'!D246,'Data Input'!E246,'Data Input'!K246,'Data Input'!M246,'Data Input'!Y246))","v":""},{"$f":"IF(I241=\"\",\"\",I241/COUNTIF('Data Input'!$C$8:$AA$8,\"-\"))","v":""},{"$f":"IF(ISBLANK('Data Input'!A246),\"\",SUM('Data Input'!H246,'Data Input'!I246,'Data Input'!N246,'Data Input'!S246))","v":""},{"$f":"IF(K241=\"\",\"\",K241/COUNTIF('Data Input'!$C$8:$AA$8,\"x\"))","v":""},{"$f":"IF(ISBLANK('Data Input'!A246),\"\",SUM('Data Input'!P246,'Data Input'!V246,'Data Input'!W246))","v":""},{"$f":"IF(M241=\"\",\"\",M241/COUNTIF('Data Input'!$C$8:$AA$8,\"÷\"))","v":""},{"$f":"IF(ISBLANK('Data Input'!A246),\"\",SUM('Data Input'!T246,'Data Input'!X246,'Data Input'!Z246,'Data Input'!AA246))","v":""},{"$f":"IF(O241=\"\",\"\",O241/COUNTIF('Data Input'!$C$8:$AA$8,\"F\"))","v":""}]
[{"$f":"IF('Data Input'!A247=0,\"\",'Data Input'!A247)","v":""},{"$f":"IF(ISBLANK('Data Input'!A247),\"\",COUNTIF('Data Input'!C247:AA247,\"\"))","v":""},{"$f":"IF(ISBLANK('Data Input'!A247),\"\",COUNTIF('Data Input'!C247:AA247,\"0\"))","v":""},{"$f":"IF(ISBLANK('Data Input'!A247),\"\",SUM(B242,C242))","v":""},{"$f":"IF(ISBLANK('Data Input'!A247),\"\",SUM('Data Input'!C247:AA247))","v":""},{"$f":"IF(E242=\"\",\"\",E242/(COUNTA('Data Input'!$C$8:$AA$8)))","v":""},{"$f":"IF(ISBLANK('Data Input'!A247),\"\",SUM('Data Input'!C247,'Data Input'!F247,'Data Input'!G247,'Data Input'!J247,'Data Input'!L247,'Data Input'!O247,'Data Input'!Q247,'Data Input'!R247,'Data Input'!U247))","v":""},{"$f":"IF(G242=\"\",\"\",G242/COUNTIF('Data Input'!$C$8:$AA$8,\"+\"))","v":""},{"$f":"IF(ISBLANK('Data Input'!A247),\"\",SUM('Data Input'!D247,'Data Input'!E247,'Data Input'!K247,'Data Input'!M247,'Data Input'!Y247))","v":""},{"$f":"IF(I242=\"\",\"\",I242/COUNTIF('Data Input'!$C$8:$AA$8,\"-\"))","v":""},{"$f":"IF(ISBLANK('Data Input'!A247),\"\",SUM('Data Input'!H247,'Data Input'!I247,'Data Input'!N247,'Data Input'!S247))","v":""},{"$f":"IF(K242=\"\",\"\",K242/COUNTIF('Data Input'!$C$8:$AA$8,\"x\"))","v":""},{"$f":"IF(ISBLANK('Data Input'!A247),\"\",SUM('Data Input'!P247,'Data Input'!V247,'Data Input'!W247))","v":""},{"$f":"IF(M242=\"\",\"\",M242/COUNTIF('Data Input'!$C$8:$AA$8,\"÷\"))","v":""},{"$f":"IF(ISBLANK('Data Input'!A247),\"\",SUM('Data Input'!T247,'Data Input'!X247,'Data Input'!Z247,'Data Input'!AA247))","v":""},{"$f":"IF(O242=\"\",\"\",O242/COUNTIF('Data Input'!$C$8:$AA$8,\"F\"))","v":""}]
[{"$f":"IF('Data Input'!A248=0,\"\",'Data Input'!A248)","v":""},{"$f":"IF(ISBLANK('Data Input'!A248),\"\",COUNTIF('Data Input'!C248:AA248,\"\"))","v":""},{"$f":"IF(ISBLANK('Data Input'!A248),\"\",COUNTIF('Data Input'!C248:AA248,\"0\"))","v":""},{"$f":"IF(ISBLANK('Data Input'!A248),\"\",SUM(B243,C243))","v":""},{"$f":"IF(ISBLANK('Data Input'!A248),\"\",SUM('Data Input'!C248:AA248))","v":""},{"$f":"IF(E243=\"\",\"\",E243/(COUNTA('Data Input'!$C$8:$AA$8)))","v":""},{"$f":"IF(ISBLANK('Data Input'!A248),\"\",SUM('Data Input'!C248,'Data Input'!F248,'Data Input'!G248,'Data Input'!J248,'Data Input'!L248,'Data Input'!O248,'Data Input'!Q248,'Data Input'!R248,'Data Input'!U248))","v":""},{"$f":"IF(G243=\"\",\"\",G243/COUNTIF('Data Input'!$C$8:$AA$8,\"+\"))","v":""},{"$f":"IF(ISBLANK('Data Input'!A248),\"\",SUM('Data Input'!D248,'Data Input'!E248,'Data Input'!K248,'Data Input'!M248,'Data Input'!Y248))","v":""},{"$f":"IF(I243=\"\",\"\",I243/COUNTIF('Data Input'!$C$8:$AA$8,\"-\"))","v":""},{"$f":"IF(ISBLANK('Data Input'!A248),\"\",SUM('Data Input'!H248,'Data Input'!I248,'Data Input'!N248,'Data Input'!S248))","v":""},{"$f":"IF(K243=\"\",\"\",K243/COUNTIF('Data Input'!$C$8:$AA$8,\"x\"))","v":""},{"$f":"IF(ISBLANK('Data Input'!A248),\"\",SUM('Data Input'!P248,'Data Input'!V248,'Data Input'!W248))","v":""},{"$f":"IF(M243=\"\",\"\",M243/COUNTIF('Data Input'!$C$8:$AA$8,\"÷\"))","v":""},{"$f":"IF(ISBLANK('Data Input'!A248),\"\",SUM('Data Input'!T248,'Data Input'!X248,'Data Input'!Z248,'Data Input'!AA248))","v":""},{"$f":"IF(O243=\"\",\"\",O243/COUNTIF('Data Input'!$C$8:$AA$8,\"F\"))","v":""}]
[{"$f":"IF('Data Input'!A249=0,\"\",'Data Input'!A249)","v":""},{"$f":"IF(ISBLANK('Data Input'!A249),\"\",COUNTIF('Data Input'!C249:AA249,\"\"))","v":""},{"$f":"IF(ISBLANK('Data Input'!A249),\"\",COUNTIF('Data Input'!C249:AA249,\"0\"))","v":""},{"$f":"IF(ISBLANK('Data Input'!A249),\"\",SUM(B244,C244))","v":""},{"$f":"IF(ISBLANK('Data Input'!A249),\"\",SUM('Data Input'!C249:AA249))","v":""},{"$f":"IF(E244=\"\",\"\",E244/(COUNTA('Data Input'!$C$8:$AA$8)))","v":""},{"$f":"IF(ISBLANK('Data Input'!A249),\"\",SUM('Data Input'!C249,'Data Input'!F249,'Data Input'!G249,'Data Input'!J249,'Data Input'!L249,'Data Input'!O249,'Data Input'!Q249,'Data Input'!R249,'Data Input'!U249))","v":""},{"$f":"IF(G244=\"\",\"\",G244/COUNTIF('Data Input'!$C$8:$AA$8,\"+\"))","v":""},{"$f":"IF(ISBLANK('Data Input'!A249),\"\",SUM('Data Input'!D249,'Data Input'!E249,'Data Input'!K249,'Data Input'!M249,'Data Input'!Y249))","v":""},{"$f":"IF(I244=\"\",\"\",I244/COUNTIF('Data Input'!$C$8:$AA$8,\"-\"))","v":""},{"$f":"IF(ISBLANK('Data Input'!A249),\"\",SUM('Data Input'!H249,'Data Input'!I249,'Data Input'!N249,'Data Input'!S249))","v":""},{"$f":"IF(K244=\"\",\"\",K244/COUNTIF('Data Input'!$C$8:$AA$8,\"x\"))","v":""},{"$f":"IF(ISBLANK('Data Input'!A249),\"\",SUM('Data Input'!P249,'Data Input'!V249,'Data Input'!W249))","v":""},{"$f":"IF(M244=\"\",\"\",M244/COUNTIF('Data Input'!$C$8:$AA$8,\"÷\"))","v":""},{"$f":"IF(ISBLANK('Data Input'!A249),\"\",SUM('Data Input'!T249,'Data Input'!X249,'Data Input'!Z249,'Data Input'!AA249))","v":""},{"$f":"IF(O244=\"\",\"\",O244/COUNTIF('Data Input'!$C$8:$AA$8,\"F\"))","v":""}]
[{"$f":"IF('Data Input'!A250=0,\"\",'Data Input'!A250)","v":""},{"$f":"IF(ISBLANK('Data Input'!A250),\"\",COUNTIF('Data Input'!C250:AA250,\"\"))","v":""},{"$f":"IF(ISBLANK('Data Input'!A250),\"\",COUNTIF('Data Input'!C250:AA250,\"0\"))","v":""},{"$f":"IF(ISBLANK('Data Input'!A250),\"\",SUM(B245,C245))","v":""},{"$f":"IF(ISBLANK('Data Input'!A250),\"\",SUM('Data Input'!C250:AA250))","v":""},{"$f":"IF(E245=\"\",\"\",E245/(COUNTA('Data Input'!$C$8:$AA$8)))","v":""},{"$f":"IF(ISBLANK('Data Input'!A250),\"\",SUM('Data Input'!C250,'Data Input'!F250,'Data Input'!G250,'Data Input'!J250,'Data Input'!L250,'Data Input'!O250,'Data Input'!Q250,'Data Input'!R250,'Data Input'!U250))","v":""},{"$f":"IF(G245=\"\",\"\",G245/COUNTIF('Data Input'!$C$8:$AA$8,\"+\"))","v":""},{"$f":"IF(ISBLANK('Data Input'!A250),\"\",SUM('Data Input'!D250,'Data Input'!E250,'Data Input'!K250,'Data Input'!M250,'Data Input'!Y250))","v":""},{"$f":"IF(I245=\"\",\"\",I245/COUNTIF('Data Input'!$C$8:$AA$8,\"-\"))","v":""},{"$f":"IF(ISBLANK('Data Input'!A250),\"\",SUM('Data Input'!H250,'Data Input'!I250,'Data Input'!N250,'Data Input'!S250))","v":""},{"$f":"IF(K245=\"\",\"\",K245/COUNTIF('Data Input'!$C$8:$AA$8,\"x\"))","v":""},{"$f":"IF(ISBLANK('Data Input'!A250),\"\",SUM('Data Input'!P250,'Data Input'!V250,'Data Input'!W250))","v":""},{"$f":"IF(M245=\"\",\"\",M245/COUNTIF('Data Input'!$C$8:$AA$8,\"÷\"))","v":""},{"$f":"IF(ISBLANK('Data Input'!A250),\"\",SUM('Data Input'!T250,'Data Input'!X250,'Data Input'!Z250,'Data Input'!AA250))","v":""},{"$f":"IF(O245=\"\",\"\",O245/COUNTIF('Data Input'!$C$8:$AA$8,\"F\"))","v":""}]
[{"$f":"IF('Data Input'!A251=0,\"\",'Data Input'!A251)","v":""},{"$f":"IF(ISBLANK('Data Input'!A251),\"\",COUNTIF('Data Input'!C251:AA251,\"\"))","v":""},{"$f":"IF(ISBLANK('Data Input'!A251),\"\",COUNTIF('Data Input'!C251:AA251,\"0\"))","v":""},{"$f":"IF(ISBLANK('Data Input'!A251),\"\",SUM(B246,C246))","v":""},{"$f":"IF(ISBLANK('Data Input'!A251),\"\",SUM('Data Input'!C251:AA251))","v":""},{"$f":"IF(E246=\"\",\"\",E246/(COUNTA('Data Input'!$C$8:$AA$8)))","v":""},{"$f":"IF(ISBLANK('Data Input'!A251),\"\",SUM('Data Input'!C251,'Data Input'!F251,'Data Input'!G251,'Data Input'!J251,'Data Input'!L251,'Data Input'!O251,'Data Input'!Q251,'Data Input'!R251,'Data Input'!U251))","v":""},{"$f":"IF(G246=\"\",\"\",G246/COUNTIF('Data Input'!$C$8:$AA$8,\"+\"))","v":""},{"$f":"IF(ISBLANK('Data Input'!A251),\"\",SUM('Data Input'!D251,'Data Input'!E251,'Data Input'!K251,'Data Input'!M251,'Data Input'!Y251))","v":""},{"$f":"IF(I246=\"\",\"\",I246/COUNTIF('Data Input'!$C$8:$AA$8,\"-\"))","v":""},{"$f":"IF(ISBLANK('Data Input'!A251),\"\",SUM('Data Input'!H251,'Data Input'!I251,'Data Input'!N251,'Data Input'!S251))","v":""},{"$f":"IF(K246=\"\",\"\",K246/COUNTIF('Data Input'!$C$8:$AA$8,\"x\"))","v":""},{"$f":"IF(ISBLANK('Data Input'!A251),\"\",SUM('Data Input'!P251,'Data Input'!V251,'Data Input'!W251))","v":""},{"$f":"IF(M246=\"\",\"\",M246/COUNTIF('Data Input'!$C$8:$AA$8,\"÷\"))","v":""},{"$f":"IF(ISBLANK('Data Input'!A251),\"\",SUM('Data Input'!T251,'Data Input'!X251,'Data Input'!Z251,'Data Input'!AA251))","v":""},{"$f":"IF(O246=\"\",\"\",O246/COUNTIF('Data Input'!$C$8:$AA$8,\"F\"))","v":""}]
[{"$f":"IF('Data Input'!A252=0,\"\",'Data Input'!A252)","v":""},{"$f":"IF(ISBLANK('Data Input'!A252),\"\",COUNTIF('Data Input'!C252:AA252,\"\"))","v":""},{"$f":"IF(ISBLANK('Data Input'!A252),\"\",COUNTIF('Data Input'!C252:AA252,\"0\"))","v":""},{"$f":"IF(ISBLANK('Data Input'!A252),\"\",SUM(B247,C247))","v":""},{"$f":"IF(ISBLANK('Data Input'!A252),\"\",SUM('Data Input'!C252:AA252))","v":""},{"$f":"IF(E247=\"\",\"\",E247/(COUNTA('Data Input'!$C$8:$AA$8)))","v":""},{"$f":"IF(ISBLANK('Data Input'!A252),\"\",SUM('Data Input'!C252,'Data Input'!F252,'Data Input'!G252,'Data Input'!J252,'Data Input'!L252,'Data Input'!O252,'Data Input'!Q252,'Data Input'!R252,'Data Input'!U252))","v":""},{"$f":"IF(G247=\"\",\"\",G247/COUNTIF('Data Input'!$C$8:$AA$8,\"+\"))","v":""},{"$f":"IF(ISBLANK('Data Input'!A252),\"\",SUM('Data Input'!D252,'Data Input'!E252,'Data Input'!K252,'Data Input'!M252,'Data Input'!Y252))","v":""},{"$f":"IF(I247=\"\",\"\",I247/COUNTIF('Data Input'!$C$8:$AA$8,\"-\"))","v":""},{"$f":"IF(ISBLANK('Data Input'!A252),\"\",SUM('Data Input'!H252,'Data Input'!I252,'Data Input'!N252,'Data Input'!S252))","v":""},{"$f":"IF(K247=\"\",\"\",K247/COUNTIF('Data Input'!$C$8:$AA$8,\"x\"))","v":""},{"$f":"IF(ISBLANK('Data Input'!A252),\"\",SUM('Data Input'!P252,'Data Input'!V252,'Data Input'!W252))","v":""},{"$f":"IF(M247=\"\",\"\",M247/COUNTIF('Data Input'!$C$8:$AA$8,\"÷\"))","v":""},{"$f":"IF(ISBLANK('Data Input'!A252),\"\",SUM('Data Input'!T252,'Data Input'!X252,'Data Input'!Z252,'Data Input'!AA252))","v":""},{"$f":"IF(O247=\"\",\"\",O247/COUNTIF('Data Input'!$C$8:$AA$8,\"F\"))","v":""}]
[{"$f":"IF('Data Input'!A253=0,\"\",'Data Input'!A253)","v":""},{"$f":"IF(ISBLANK('Data Input'!A253),\"\",COUNTIF('Data Input'!C253:AA253,\"\"))","v":""},{"$f":"IF(ISBLANK('Data Input'!A253),\"\",COUNTIF('Data Input'!C253:AA253,\"0\"))","v":""},{"$f":"IF(ISBLANK('Data Input'!A253),\"\",SUM(B248,C248))","v":""},{"$f":"IF(ISBLANK('Data Input'!A253),\"\",SUM('Data Input'!C253:AA253))","v":""},{"$f":"IF(E248=\"\",\"\",E248/(COUNTA('Data Input'!$C$8:$AA$8)))","v":""},{"$f":"IF(ISBLANK('Data Input'!A253),\"\",SUM('Data Input'!C253,'Data Input'!F253,'Data Input'!G253,'Data Input'!J253,'Data Input'!L253,'Data Input'!O253,'Data Input'!Q253,'Data Input'!R253,'Data Input'!U253))","v":""},{"$f":"IF(G248=\"\",\"\",G248/COUNTIF('Data Input'!$C$8:$AA$8,\"+\"))","v":""},{"$f":"IF(ISBLANK('Data Input'!A253),\"\",SUM('Data Input'!D253,'Data Input'!E253,'Data Input'!K253,'Data Input'!M253,'Data Input'!Y253))","v":""},{"$f":"IF(I248=\"\",\"\",I248/COUNTIF('Data Input'!$C$8:$AA$8,\"-\"))","v":""},{"$f":"IF(ISBLANK('Data Input'!A253),\"\",SUM('Data Input'!H253,'Data Input'!I253,'Data Input'!N253,'Data Input'!S253))","v":""},{"$f":"IF(K248=\"\",\"\",K248/COUNTIF('Data Input'!$C$8:$AA$8,\"x\"))","v":""},{"$f":"IF(ISBLANK('Data Input'!A253),\"\",SUM('Data Input'!P253,'Data Input'!V253,'Data Input'!W253))","v":""},{"$f":"IF(M248=\"\",\"\",M248/COUNTIF('Data Input'!$C$8:$AA$8,\"÷\"))","v":""},{"$f":"IF(ISBLANK('Data Input'!A253),\"\",SUM('Data Input'!T253,'Data Input'!X253,'Data Input'!Z253,'Data Input'!AA253))","v":""},{"$f":"IF(O248=\"\",\"\",O248/COUNTIF('Data Input'!$C$8:$AA$8,\"F\"))","v":""}]
[{"$f":"IF('Data Input'!A254=0,\"\",'Data Input'!A254)","v":""},{"$f":"IF(ISBLANK('Data Input'!A254),\"\",COUNTIF('Data Input'!C254:AA254,\"\"))","v":""},{"$f":"IF(ISBLANK('Data Input'!A254),\"\",COUNTIF('Data Input'!C254:AA254,\"0\"))","v":""},{"$f":"IF(ISBLANK('Data Input'!A254),\"\",SUM(B249,C249))","v":""},{"$f":"IF(ISBLANK('Data Input'!A254),\"\",SUM('Data Input'!C254:AA254))","v":""},{"$f":"IF(E249=\"\",\"\",E249/(COUNTA('Data Input'!$C$8:$AA$8)))","v":""},{"$f":"IF(ISBLANK('Data Input'!A254),\"\",SUM('Data Input'!C254,'Data Input'!F254,'Data Input'!G254,'Data Input'!J254,'Data Input'!L254,'Data Input'!O254,'Data Input'!Q254,'Data Input'!R254,'Data Input'!U254))","v":""},{"$f":"IF(G249=\"\",\"\",G249/COUNTIF('Data Input'!$C$8:$AA$8,\"+\"))","v":""},{"$f":"IF(ISBLANK('Data Input'!A254),\"\",SUM('Data Input'!D254,'Data Input'!E254,'Data Input'!K254,'Data Input'!M254,'Data Input'!Y254))","v":""},{"$f":"IF(I249=\"\",\"\",I249/COUNTIF('Data Input'!$C$8:$AA$8,\"-\"))","v":""},{"$f":"IF(ISBLANK('Data Input'!A254),\"\",SUM('Data Input'!H254,'Data Input'!I254,'Data Input'!N254,'Data Input'!S254))","v":""},{"$f":"IF(K249=\"\",\"\",K249/COUNTIF('Data Input'!$C$8:$AA$8,\"x\"))","v":""},{"$f":"IF(ISBLANK('Data Input'!A254),\"\",SUM('Data Input'!P254,'Data Input'!V254,'Data Input'!W254))","v":""},{"$f":"IF(M249=\"\",\"\",M249/COUNTIF('Data Input'!$C$8:$AA$8,\"÷\"))","v":""},{"$f":"IF(ISBLANK('Data Input'!A254),\"\",SUM('Data Input'!T254,'Data Input'!X254,'Data Input'!Z254,'Data Input'!AA254))","v":""},{"$f":"IF(O249=\"\",\"\",O249/COUNTIF('Data Input'!$C$8:$AA$8,\"F\"))","v":""}]
[{"$f":"IF('Data Input'!A255=0,\"\",'Data Input'!A255)","v":""},{"$f":"IF(ISBLANK('Data Input'!A255),\"\",COUNTIF('Data Input'!C255:AA255,\"\"))","v":""},{"$f":"IF(ISBLANK('Data Input'!A255),\"\",COUNTIF('Data Input'!C255:AA255,\"0\"))","v":""},{"$f":"IF(ISBLANK('Data Input'!A255),\"\",SUM(B250,C250))","v":""},{"$f":"IF(ISBLANK('Data Input'!A255),\"\",SUM('Data Input'!C255:AA255))","v":""},{"$f":"IF(E250=\"\",\"\",E250/(COUNTA('Data Input'!$C$8:$AA$8)))","v":""},{"$f":"IF(ISBLANK('Data Input'!A255),\"\",SUM('Data Input'!C255,'Data Input'!F255,'Data Input'!G255,'Data Input'!J255,'Data Input'!L255,'Data Input'!O255,'Data Input'!Q255,'Data Input'!R255,'Data Input'!U255))","v":""},{"$f":"IF(G250=\"\",\"\",G250/COUNTIF('Data Input'!$C$8:$AA$8,\"+\"))","v":""},{"$f":"IF(ISBLANK('Data Input'!A255),\"\",SUM('Data Input'!D255,'Data Input'!E255,'Data Input'!K255,'Data Input'!M255,'Data Input'!Y255))","v":""},{"$f":"IF(I250=\"\",\"\",I250/COUNTIF('Data Input'!$C$8:$AA$8,\"-\"))","v":""},{"$f":"IF(ISBLANK('Data Input'!A255),\"\",SUM('Data Input'!H255,'Data Input'!I255,'Data Input'!N255,'Data Input'!S255))","v":""},{"$f":"IF(K250=\"\",\"\",K250/COUNTIF('Data Input'!$C$8:$AA$8,\"x\"))","v":""},{"$f":"IF(ISBLANK('Data Input'!A255),\"\",SUM('Data Input'!P255,'Data Input'!V255,'Data Input'!W255))","v":""},{"$f":"IF(M250=\"\",\"\",M250/COUNTIF('Data Input'!$C$8:$AA$8,\"÷\"))","v":""},{"$f":"IF(ISBLANK('Data Input'!A255),\"\",SUM('Data Input'!T255,'Data Input'!X255,'Data Input'!Z255,'Data Input'!AA255))","v":""},{"$f":"IF(O250=\"\",\"\",O250/COUNTIF('Data Input'!$C$8:$AA$8,\"F\"))","v":""}]
[{"$f":"IF('Data Input'!A256=0,\"\",'Data Input'!A256)","v":""},{"$f":"IF(ISBLANK('Data Input'!A256),\"\",COUNTIF('Data Input'!C256:AA256,\"\"))","v":""},{"$f":"IF(ISBLANK('Data Input'!A256),\"\",COUNTIF('Data Input'!C256:AA256,\"0\"))","v":""},{"$f":"IF(ISBLANK('Data Input'!A256),\"\",SUM(B251,C251))","v":""},{"$f":"IF(ISBLANK('Data Input'!A256),\"\",SUM('Data Input'!C256:AA256))","v":""},{"$f":"IF(E251=\"\",\"\",E251/(COUNTA('Data Input'!$C$8:$AA$8)))","v":""},{"$f":"IF(ISBLANK('Data Input'!A256),\"\",SUM('Data Input'!C256,'Data Input'!F256,'Data Input'!G256,'Data Input'!J256,'Data Input'!L256,'Data Input'!O256,'Data Input'!Q256,'Data Input'!R256,'Data Input'!U256))","v":""},{"$f":"IF(G251=\"\",\"\",G251/COUNTIF('Data Input'!$C$8:$AA$8,\"+\"))","v":""},{"$f":"IF(ISBLANK('Data Input'!A256),\"\",SUM('Data Input'!D256,'Data Input'!E256,'Data Input'!K256,'Data Input'!M256,'Data Input'!Y256))","v":""},{"$f":"IF(I251=\"\",\"\",I251/COUNTIF('Data Input'!$C$8:$AA$8,\"-\"))","v":""},{"$f":"IF(ISBLANK('Data Input'!A256),\"\",SUM('Data Input'!H256,'Data Input'!I256,'Data Input'!N256,'Data Input'!S256))","v":""},{"$f":"IF(K251=\"\",\"\",K251/COUNTIF('Data Input'!$C$8:$AA$8,\"x\"))","v":""},{"$f":"IF(ISBLANK('Data Input'!A256),\"\",SUM('Data Input'!P256,'Data Input'!V256,'Data Input'!W256))","v":""},{"$f":"IF(M251=\"\",\"\",M251/COUNTIF('Data Input'!$C$8:$AA$8,\"÷\"))","v":""},{"$f":"IF(ISBLANK('Data Input'!A256),\"\",SUM('Data Input'!T256,'Data Input'!X256,'Data Input'!Z256,'Data Input'!AA256))","v":""},{"$f":"IF(O251=\"\",\"\",O251/COUNTIF('Data Input'!$C$8:$AA$8,\"F\"))","v":""}]
[{"$f":"IF('Data Input'!A257=0,\"\",'Data Input'!A257)","v":""},{"$f":"IF(ISBLANK('Data Input'!A257),\"\",COUNTIF('Data Input'!C257:AA257,\"\"))","v":""},{"$f":"IF(ISBLANK('Data Input'!A257),\"\",COUNTIF('Data Input'!C257:AA257,\"0\"))","v":""},{"$f":"IF(ISBLANK('Data Input'!A257),\"\",SUM(B252,C252))","v":""},{"$f":"IF(ISBLANK('Data Input'!A257),\"\",SUM('Data Input'!C257:AA257))","v":""},{"$f":"IF(E252=\"\",\"\",E252/(COUNTA('Data Input'!$C$8:$AA$8)))","v":""},{"$f":"IF(ISBLANK('Data Input'!A257),\"\",SUM('Data Input'!C257,'Data Input'!F257,'Data Input'!G257,'Data Input'!J257,'Data Input'!L257,'Data Input'!O257,'Data Input'!Q257,'Data Input'!R257,'Data Input'!U257))","v":""},{"$f":"IF(G252=\"\",\"\",G252/COUNTIF('Data Input'!$C$8:$AA$8,\"+\"))","v":""},{"$f":"IF(ISBLANK('Data Input'!A257),\"\",SUM('Data Input'!D257,'Data Input'!E257,'Data Input'!K257,'Data Input'!M257,'Data Input'!Y257))","v":""},{"$f":"IF(I252=\"\",\"\",I252/COUNTIF('Data Input'!$C$8:$AA$8,\"-\"))","v":""},{"$f":"IF(ISBLANK('Data Input'!A257),\"\",SUM('Data Input'!H257,'Data Input'!I257,'Data Input'!N257,'Data Input'!S257))","v":""},{"$f":"IF(K252=\"\",\"\",K252/COUNTIF('Data Input'!$C$8:$AA$8,\"x\"))","v":""},{"$f":"IF(ISBLANK('Data Input'!A257),\"\",SUM('Data Input'!P257,'Data Input'!V257,'Data Input'!W257))","v":""},{"$f":"IF(M252=\"\",\"\",M252/COUNTIF('Data Input'!$C$8:$AA$8,\"÷\"))","v":""},{"$f":"IF(ISBLANK('Data Input'!A257),\"\",SUM('Data Input'!T257,'Data Input'!X257,'Data Input'!Z257,'Data Input'!AA257))","v":""},{"$f":"IF(O252=\"\",\"\",O252/COUNTIF('Data Input'!$C$8:$AA$8,\"F\"))","v":""}]
[{"$f":"IF('Data Input'!A258=0,\"\",'Data Input'!A258)","v":""},{"$f":"IF(ISBLANK('Data Input'!A258),\"\",COUNTIF('Data Input'!C258:AA258,\"\"))","v":""},{"$f":"IF(ISBLANK('Data Input'!A258),\"\",COUNTIF('Data Input'!C258:AA258,\"0\"))","v":""},{"$f":"IF(ISBLANK('Data Input'!A258),\"\",SUM(B253,C253))","v":""},{"$f":"IF(ISBLANK('Data Input'!A258),\"\",SUM('Data Input'!C258:AA258))","v":""},{"$f":"IF(E253=\"\",\"\",E253/(COUNTA('Data Input'!$C$8:$AA$8)))","v":""},{"$f":"IF(ISBLANK('Data Input'!A258),\"\",SUM('Data Input'!C258,'Data Input'!F258,'Data Input'!G258,'Data Input'!J258,'Data Input'!L258,'Data Input'!O258,'Data Input'!Q258,'Data Input'!R258,'Data Input'!U258))","v":""},{"$f":"IF(G253=\"\",\"\",G253/COUNTIF('Data Input'!$C$8:$AA$8,\"+\"))","v":""},{"$f":"IF(ISBLANK('Data Input'!A258),\"\",SUM('Data Input'!D258,'Data Input'!E258,'Data Input'!K258,'Data Input'!M258,'Data Input'!Y258))","v":""},{"$f":"IF(I253=\"\",\"\",I253/COUNTIF('Data Input'!$C$8:$AA$8,\"-\"))","v":""},{"$f":"IF(ISBLANK('Data Input'!A258),\"\",SUM('Data Input'!H258,'Data Input'!I258,'Data Input'!N258,'Data Input'!S258))","v":""},{"$f":"IF(K253=\"\",\"\",K253/COUNTIF('Data Input'!$C$8:$AA$8,\"x\"))","v":""},{"$f":"IF(ISBLANK('Data Input'!A258),\"\",SUM('Data Input'!P258,'Data Input'!V258,'Data Input'!W258))","v":""},{"$f":"IF(M253=\"\",\"\",M253/COUNTIF('Data Input'!$C$8:$AA$8,\"÷\"))","v":""},{"$f":"IF(ISBLANK('Data Input'!A258),\"\",SUM('Data Input'!T258,'Data Input'!X258,'Data Input'!Z258,'Data Input'!AA258))","v":""},{"$f":"IF(O253=\"\",\"\",O253/COUNTIF('Data Input'!$C$8:$AA$8,\"F\"))","v":""}]
[{"$f":"IF('Data Input'!A259=0,\"\",'Data Input'!A259)","v":""},{"$f":"IF(ISBLANK('Data Input'!A259),\"\",COUNTIF('Data Input'!C259:AA259,\"\"))","v":""},{"$f":"IF(ISBLANK('Data Input'!A259),\"\",COUNTIF('Data Input'!C259:AA259,\"0\"))","v":""},{"$f":"IF(ISBLANK('Data Input'!A259),\"\",SUM(B254,C254))","v":""},{"$f":"IF(ISBLANK('Data Input'!A259),\"\",SUM('Data Input'!C259:AA259))","v":""},{"$f":"IF(E254=\"\",\"\",E254/(COUNTA('Data Input'!$C$8:$AA$8)))","v":""},{"$f":"IF(ISBLANK('Data Input'!A259),\"\",SUM('Data Input'!C259,'Data Input'!F259,'Data Input'!G259,'Data Input'!J259,'Data Input'!L259,'Data Input'!O259,'Data Input'!Q259,'Data Input'!R259,'Data Input'!U259))","v":""},{"$f":"IF(G254=\"\",\"\",G254/COUNTIF('Data Input'!$C$8:$AA$8,\"+\"))","v":""},{"$f":"IF(ISBLANK('Data Input'!A259),\"\",SUM('Data Input'!D259,'Data Input'!E259,'Data Input'!K259,'Data Input'!M259,'Data Input'!Y259))","v":""},{"$f":"IF(I254=\"\",\"\",I254/COUNTIF('Data Input'!$C$8:$AA$8,\"-\"))","v":""},{"$f":"IF(ISBLANK('Data Input'!A259),\"\",SUM('Data Input'!H259,'Data Input'!I259,'Data Input'!N259,'Data Input'!S259))","v":""},{"$f":"IF(K254=\"\",\"\",K254/COUNTIF('Data Input'!$C$8:$AA$8,\"x\"))","v":""},{"$f":"IF(ISBLANK('Data Input'!A259),\"\",SUM('Data Input'!P259,'Data Input'!V259,'Data Input'!W259))","v":""},{"$f":"IF(M254=\"\",\"\",M254/COUNTIF('Data Input'!$C$8:$AA$8,\"÷\"))","v":""},{"$f":"IF(ISBLANK('Data Input'!A259),\"\",SUM('Data Input'!T259,'Data Input'!X259,'Data Input'!Z259,'Data Input'!AA259))","v":""},{"$f":"IF(O254=\"\",\"\",O254/COUNTIF('Data Input'!$C$8:$AA$8,\"F\"))","v":""}]
[{"$f":"IF('Data Input'!A260=0,\"\",'Data Input'!A260)","v":""},{"$f":"IF(ISBLANK('Data Input'!A260),\"\",COUNTIF('Data Input'!C260:AA260,\"\"))","v":""},{"$f":"IF(ISBLANK('Data Input'!A260),\"\",COUNTIF('Data Input'!C260:AA260,\"0\"))","v":""},{"$f":"IF(ISBLANK('Data Input'!A260),\"\",SUM(B255,C255))","v":""},{"$f":"IF(ISBLANK('Data Input'!A260),\"\",SUM('Data Input'!C260:AA260))","v":""},{"$f":"IF(E255=\"\",\"\",E255/(COUNTA('Data Input'!$C$8:$AA$8)))","v":""},{"$f":"IF(ISBLANK('Data Input'!A260),\"\",SUM('Data Input'!C260,'Data Input'!F260,'Data Input'!G260,'Data Input'!J260,'Data Input'!L260,'Data Input'!O260,'Data Input'!Q260,'Data Input'!R260,'Data Input'!U260))","v":""},{"$f":"IF(G255=\"\",\"\",G255/COUNTIF('Data Input'!$C$8:$AA$8,\"+\"))","v":""},{"$f":"IF(ISBLANK('Data Input'!A260),\"\",SUM('Data Input'!D260,'Data Input'!E260,'Data Input'!K260,'Data Input'!M260,'Data Input'!Y260))","v":""},{"$f":"IF(I255=\"\",\"\",I255/COUNTIF('Data Input'!$C$8:$AA$8,\"-\"))","v":""},{"$f":"IF(ISBLANK('Data Input'!A260),\"\",SUM('Data Input'!H260,'Data Input'!I260,'Data Input'!N260,'Data Input'!S260))","v":""},{"$f":"IF(K255=\"\",\"\",K255/COUNTIF('Data Input'!$C$8:$AA$8,\"x\"))","v":""},{"$f":"IF(ISBLANK('Data Input'!A260),\"\",SUM('Data Input'!P260,'Data Input'!V260,'Data Input'!W260))","v":""},{"$f":"IF(M255=\"\",\"\",M255/COUNTIF('Data Input'!$C$8:$AA$8,\"÷\"))","v":""},{"$f":"IF(ISBLANK('Data Input'!A260),\"\",SUM('Data Input'!T260,'Data Input'!X260,'Data Input'!Z260,'Data Input'!AA260))","v":""},{"$f":"IF(O255=\"\",\"\",O255/COUNTIF('Data Input'!$C$8:$AA$8,\"F\"))","v":""}]
[{"$f":"IF('Data Input'!A261=0,\"\",'Data Input'!A261)","v":""},{"$f":"IF(ISBLANK('Data Input'!A261),\"\",COUNTIF('Data Input'!C261:AA261,\"\"))","v":""},{"$f":"IF(ISBLANK('Data Input'!A261),\"\",COUNTIF('Data Input'!C261:AA261,\"0\"))","v":""},{"$f":"IF(ISBLANK('Data Input'!A261),\"\",SUM(B256,C256))","v":""},{"$f":"IF(ISBLANK('Data Input'!A261),\"\",SUM('Data Input'!C261:AA261))","v":""},{"$f":"IF(E256=\"\",\"\",E256/(COUNTA('Data Input'!$C$8:$AA$8)))","v":""},{"$f":"IF(ISBLANK('Data Input'!A261),\"\",SUM('Data Input'!C261,'Data Input'!F261,'Data Input'!G261,'Data Input'!J261,'Data Input'!L261,'Data Input'!O261,'Data Input'!Q261,'Data Input'!R261,'Data Input'!U261))","v":""},{"$f":"IF(G256=\"\",\"\",G256/COUNTIF('Data Input'!$C$8:$AA$8,\"+\"))","v":""},{"$f":"IF(ISBLANK('Data Input'!A261),\"\",SUM('Data Input'!D261,'Data Input'!E261,'Data Input'!K261,'Data Input'!M261,'Data Input'!Y261))","v":""},{"$f":"IF(I256=\"\",\"\",I256/COUNTIF('Data Input'!$C$8:$AA$8,\"-\"))","v":""},{"$f":"IF(ISBLANK('Data Input'!A261),\"\",SUM('Data Input'!H261,'Data Input'!I261,'Data Input'!N261,'Data Input'!S261))","v":""},{"$f":"IF(K256=\"\",\"\",K256/COUNTIF('Data Input'!$C$8:$AA$8,\"x\"))","v":""},{"$f":"IF(ISBLANK('Data Input'!A261),\"\",SUM('Data Input'!P261,'Data Input'!V261,'Data Input'!W261))","v":""},{"$f":"IF(M256=\"\",\"\",M256/COUNTIF('Data Input'!$C$8:$AA$8,\"÷\"))","v":""},{"$f":"IF(ISBLANK('Data Input'!A261),\"\",SUM('Data Input'!T261,'Data Input'!X261,'Data Input'!Z261,'Data Input'!AA261))","v":""},{"$f":"IF(O256=\"\",\"\",O256/COUNTIF('Data Input'!$C$8:$AA$8,\"F\"))","v":""}]
[{"$f":"IF('Data Input'!A262=0,\"\",'Data Input'!A262)","v":""},{"$f":"IF(ISBLANK('Data Input'!A262),\"\",COUNTIF('Data Input'!C262:AA262,\"\"))","v":""},{"$f":"IF(ISBLANK('Data Input'!A262),\"\",COUNTIF('Data Input'!C262:AA262,\"0\"))","v":""},{"$f":"IF(ISBLANK('Data Input'!A262),\"\",SUM(B257,C257))","v":""},{"$f":"IF(ISBLANK('Data Input'!A262),\"\",SUM('Data Input'!C262:AA262))","v":""},{"$f":"IF(E257=\"\",\"\",E257/(COUNTA('Data Input'!$C$8:$AA$8)))","v":""},{"$f":"IF(ISBLANK('Data Input'!A262),\"\",SUM('Data Input'!C262,'Data Input'!F262,'Data Input'!G262,'Data Input'!J262,'Data Input'!L262,'Data Input'!O262,'Data Input'!Q262,'Data Input'!R262,'Data Input'!U262))","v":""},{"$f":"IF(G257=\"\",\"\",G257/COUNTIF('Data Input'!$C$8:$AA$8,\"+\"))","v":""},{"$f":"IF(ISBLANK('Data Input'!A262),\"\",SUM('Data Input'!D262,'Data Input'!E262,'Data Input'!K262,'Data Input'!M262,'Data Input'!Y262))","v":""},{"$f":"IF(I257=\"\",\"\",I257/COUNTIF('Data Input'!$C$8:$AA$8,\"-\"))","v":""},{"$f":"IF(ISBLANK('Data Input'!A262),\"\",SUM('Data Input'!H262,'Data Input'!I262,'Data Input'!N262,'Data Input'!S262))","v":""},{"$f":"IF(K257=\"\",\"\",K257/COUNTIF('Data Input'!$C$8:$AA$8,\"x\"))","v":""},{"$f":"IF(ISBLANK('Data Input'!A262),\"\",SUM('Data Input'!P262,'Data Input'!V262,'Data Input'!W262))","v":""},{"$f":"IF(M257=\"\",\"\",M257/COUNTIF('Data Input'!$C$8:$AA$8,\"÷\"))","v":""},{"$f":"IF(ISBLANK('Data Input'!A262),\"\",SUM('Data Input'!T262,'Data Input'!X262,'Data Input'!Z262,'Data Input'!AA262))","v":""},{"$f":"IF(O257=\"\",\"\",O257/COUNTIF('Data Input'!$C$8:$AA$8,\"F\"))","v":""}]
[{"$f":"IF('Data Input'!A263=0,\"\",'Data Input'!A263)","v":""},{"$f":"IF(ISBLANK('Data Input'!A263),\"\",COUNTIF('Data Input'!C263:AA263,\"\"))","v":""},{"$f":"IF(ISBLANK('Data Input'!A263),\"\",COUNTIF('Data Input'!C263:AA263,\"0\"))","v":""},{"$f":"IF(ISBLANK('Data Input'!A263),\"\",SUM(B258,C258))","v":""},{"$f":"IF(ISBLANK('Data Input'!A263),\"\",SUM('Data Input'!C263:AA263))","v":""},{"$f":"IF(E258=\"\",\"\",E258/(COUNTA('Data Input'!$C$8:$AA$8)))","v":""},{"$f":"IF(ISBLANK('Data Input'!A263),\"\",SUM('Data Input'!C263,'Data Input'!F263,'Data Input'!G263,'Data Input'!J263,'Data Input'!L263,'Data Input'!O263,'Data Input'!Q263,'Data Input'!R263,'Data Input'!U263))","v":""},{"$f":"IF(G258=\"\",\"\",G258/COUNTIF('Data Input'!$C$8:$AA$8,\"+\"))","v":""},{"$f":"IF(ISBLANK('Data Input'!A263),\"\",SUM('Data Input'!D263,'Data Input'!E263,'Data Input'!K263,'Data Input'!M263,'Data Input'!Y263))","v":""},{"$f":"IF(I258=\"\",\"\",I258/COUNTIF('Data Input'!$C$8:$AA$8,\"-\"))","v":""},{"$f":"IF(ISBLANK('Data Input'!A263),\"\",SUM('Data Input'!H263,'Data Input'!I263,'Data Input'!N263,'Data Input'!S263))","v":""},{"$f":"IF(K258=\"\",\"\",K258/COUNTIF('Data Input'!$C$8:$AA$8,\"x\"))","v":""},{"$f":"IF(ISBLANK('Data Input'!A263),\"\",SUM('Data Input'!P263,'Data Input'!V263,'Data Input'!W263))","v":""},{"$f":"IF(M258=\"\",\"\",M258/COUNTIF('Data Input'!$C$8:$AA$8,\"÷\"))","v":""},{"$f":"IF(ISBLANK('Data Input'!A263),\"\",SUM('Data Input'!T263,'Data Input'!X263,'Data Input'!Z263,'Data Input'!AA263))","v":""},{"$f":"IF(O258=\"\",\"\",O258/COUNTIF('Data Input'!$C$8:$AA$8,\"F\"))","v":""}]
[{"$f":"IF('Data Input'!A264=0,\"\",'Data Input'!A264)","v":""},{"$f":"IF(ISBLANK('Data Input'!A264),\"\",COUNTIF('Data Input'!C264:AA264,\"\"))","v":""},{"$f":"IF(ISBLANK('Data Input'!A264),\"\",COUNTIF('Data Input'!C264:AA264,\"0\"))","v":""},{"$f":"IF(ISBLANK('Data Input'!A264),\"\",SUM(B259,C259))","v":""},{"$f":"IF(ISBLANK('Data Input'!A264),\"\",SUM('Data Input'!C264:AA264))","v":""},{"$f":"IF(E259=\"\",\"\",E259/(COUNTA('Data Input'!$C$8:$AA$8)))","v":""},{"$f":"IF(ISBLANK('Data Input'!A264),\"\",SUM('Data Input'!C264,'Data Input'!F264,'Data Input'!G264,'Data Input'!J264,'Data Input'!L264,'Data Input'!O264,'Data Input'!Q264,'Data Input'!R264,'Data Input'!U264))","v":""},{"$f":"IF(G259=\"\",\"\",G259/COUNTIF('Data Input'!$C$8:$AA$8,\"+\"))","v":""},{"$f":"IF(ISBLANK('Data Input'!A264),\"\",SUM('Data Input'!D264,'Data Input'!E264,'Data Input'!K264,'Data Input'!M264,'Data Input'!Y264))","v":""},{"$f":"IF(I259=\"\",\"\",I259/COUNTIF('Data Input'!$C$8:$AA$8,\"-\"))","v":""},{"$f":"IF(ISBLANK('Data Input'!A264),\"\",SUM('Data Input'!H264,'Data Input'!I264,'Data Input'!N264,'Data Input'!S264))","v":""},{"$f":"IF(K259=\"\",\"\",K259/COUNTIF('Data Input'!$C$8:$AA$8,\"x\"))","v":""},{"$f":"IF(ISBLANK('Data Input'!A264),\"\",SUM('Data Input'!P264,'Data Input'!V264,'Data Input'!W264))","v":""},{"$f":"IF(M259=\"\",\"\",M259/COUNTIF('Data Input'!$C$8:$AA$8,\"÷\"))","v":""},{"$f":"IF(ISBLANK('Data Input'!A264),\"\",SUM('Data Input'!T264,'Data Input'!X264,'Data Input'!Z264,'Data Input'!AA264))","v":""},{"$f":"IF(O259=\"\",\"\",O259/COUNTIF('Data Input'!$C$8:$AA$8,\"F\"))","v":""}]
[{"$f":"IF('Data Input'!A265=0,\"\",'Data Input'!A265)","v":""},{"$f":"IF(ISBLANK('Data Input'!A265),\"\",COUNTIF('Data Input'!C265:AA265,\"\"))","v":""},{"$f":"IF(ISBLANK('Data Input'!A265),\"\",COUNTIF('Data Input'!C265:AA265,\"0\"))","v":""},{"$f":"IF(ISBLANK('Data Input'!A265),\"\",SUM(B260,C260))","v":""},{"$f":"IF(ISBLANK('Data Input'!A265),\"\",SUM('Data Input'!C265:AA265))","v":""},{"$f":"IF(E260=\"\",\"\",E260/(COUNTA('Data Input'!$C$8:$AA$8)))","v":""},{"$f":"IF(ISBLANK('Data Input'!A265),\"\",SUM('Data Input'!C265,'Data Input'!F265,'Data Input'!G265,'Data Input'!J265,'Data Input'!L265,'Data Input'!O265,'Data Input'!Q265,'Data Input'!R265,'Data Input'!U265))","v":""},{"$f":"IF(G260=\"\",\"\",G260/COUNTIF('Data Input'!$C$8:$AA$8,\"+\"))","v":""},{"$f":"IF(ISBLANK('Data Input'!A265),\"\",SUM('Data Input'!D265,'Data Input'!E265,'Data Input'!K265,'Data Input'!M265,'Data Input'!Y265))","v":""},{"$f":"IF(I260=\"\",\"\",I260/COUNTIF('Data Input'!$C$8:$AA$8,\"-\"))","v":""},{"$f":"IF(ISBLANK('Data Input'!A265),\"\",SUM('Data Input'!H265,'Data Input'!I265,'Data Input'!N265,'Data Input'!S265))","v":""},{"$f":"IF(K260=\"\",\"\",K260/COUNTIF('Data Input'!$C$8:$AA$8,\"x\"))","v":""},{"$f":"IF(ISBLANK('Data Input'!A265),\"\",SUM('Data Input'!P265,'Data Input'!V265,'Data Input'!W265))","v":""},{"$f":"IF(M260=\"\",\"\",M260/COUNTIF('Data Input'!$C$8:$AA$8,\"÷\"))","v":""},{"$f":"IF(ISBLANK('Data Input'!A265),\"\",SUM('Data Input'!T265,'Data Input'!X265,'Data Input'!Z265,'Data Input'!AA265))","v":""},{"$f":"IF(O260=\"\",\"\",O260/COUNTIF('Data Input'!$C$8:$AA$8,\"F\"))","v":""}]
[{"$f":"IF('Data Input'!A266=0,\"\",'Data Input'!A266)","v":""},{"$f":"IF(ISBLANK('Data Input'!A266),\"\",COUNTIF('Data Input'!C266:AA266,\"\"))","v":""},{"$f":"IF(ISBLANK('Data Input'!A266),\"\",COUNTIF('Data Input'!C266:AA266,\"0\"))","v":""},{"$f":"IF(ISBLANK('Data Input'!A266),\"\",SUM(B261,C261))","v":""},{"$f":"IF(ISBLANK('Data Input'!A266),\"\",SUM('Data Input'!C266:AA266))","v":""},{"$f":"IF(E261=\"\",\"\",E261/(COUNTA('Data Input'!$C$8:$AA$8)))","v":""},{"$f":"IF(ISBLANK('Data Input'!A266),\"\",SUM('Data Input'!C266,'Data Input'!F266,'Data Input'!G266,'Data Input'!J266,'Data Input'!L266,'Data Input'!O266,'Data Input'!Q266,'Data Input'!R266,'Data Input'!U266))","v":""},{"$f":"IF(G261=\"\",\"\",G261/COUNTIF('Data Input'!$C$8:$AA$8,\"+\"))","v":""},{"$f":"IF(ISBLANK('Data Input'!A266),\"\",SUM('Data Input'!D266,'Data Input'!E266,'Data Input'!K266,'Data Input'!M266,'Data Input'!Y266))","v":""},{"$f":"IF(I261=\"\",\"\",I261/COUNTIF('Data Input'!$C$8:$AA$8,\"-\"))","v":""},{"$f":"IF(ISBLANK('Data Input'!A266),\"\",SUM('Data Input'!H266,'Data Input'!I266,'Data Input'!N266,'Data Input'!S266))","v":""},{"$f":"IF(K261=\"\",\"\",K261/COUNTIF('Data Input'!$C$8:$AA$8,\"x\"))","v":""},{"$f":"IF(ISBLANK('Data Input'!A266),\"\",SUM('Data Input'!P266,'Data Input'!V266,'Data Input'!W266))","v":""},{"$f":"IF(M261=\"\",\"\",M261/COUNTIF('Data Input'!$C$8:$AA$8,\"÷\"))","v":""},{"$f":"IF(ISBLANK('Data Input'!A266),\"\",SUM('Data Input'!T266,'Data Input'!X266,'Data Input'!Z266,'Data Input'!AA266))","v":""},{"$f":"IF(O261=\"\",\"\",O261/COUNTIF('Data Input'!$C$8:$AA$8,\"F\"))","v":""}]
[{"$f":"IF('Data Input'!A267=0,\"\",'Data Input'!A267)","v":""},{"$f":"IF(ISBLANK('Data Input'!A267),\"\",COUNTIF('Data Input'!C267:AA267,\"\"))","v":""},{"$f":"IF(ISBLANK('Data Input'!A267),\"\",COUNTIF('Data Input'!C267:AA267,\"0\"))","v":""},{"$f":"IF(ISBLANK('Data Input'!A267),\"\",SUM(B262,C262))","v":""},{"$f":"IF(ISBLANK('Data Input'!A267),\"\",SUM('Data Input'!C267:AA267))","v":""},{"$f":"IF(E262=\"\",\"\",E262/(COUNTA('Data Input'!$C$8:$AA$8)))","v":""},{"$f":"IF(ISBLANK('Data Input'!A267),\"\",SUM('Data Input'!C267,'Data Input'!F267,'Data Input'!G267,'Data Input'!J267,'Data Input'!L267,'Data Input'!O267,'Data Input'!Q267,'Data Input'!R267,'Data Input'!U267))","v":""},{"$f":"IF(G262=\"\",\"\",G262/COUNTIF('Data Input'!$C$8:$AA$8,\"+\"))","v":""},{"$f":"IF(ISBLANK('Data Input'!A267),\"\",SUM('Data Input'!D267,'Data Input'!E267,'Data Input'!K267,'Data Input'!M267,'Data Input'!Y267))","v":""},{"$f":"IF(I262=\"\",\"\",I262/COUNTIF('Data Input'!$C$8:$AA$8,\"-\"))","v":""},{"$f":"IF(ISBLANK('Data Input'!A267),\"\",SUM('Data Input'!H267,'Data Input'!I267,'Data Input'!N267,'Data Input'!S267))","v":""},{"$f":"IF(K262=\"\",\"\",K262/COUNTIF('Data Input'!$C$8:$AA$8,\"x\"))","v":""},{"$f":"IF(ISBLANK('Data Input'!A267),\"\",SUM('Data Input'!P267,'Data Input'!V267,'Data Input'!W267))","v":""},{"$f":"IF(M262=\"\",\"\",M262/COUNTIF('Data Input'!$C$8:$AA$8,\"÷\"))","v":""},{"$f":"IF(ISBLANK('Data Input'!A267),\"\",SUM('Data Input'!T267,'Data Input'!X267,'Data Input'!Z267,'Data Input'!AA267))","v":""},{"$f":"IF(O262=\"\",\"\",O262/COUNTIF('Data Input'!$C$8:$AA$8,\"F\"))","v":""}]
[{"$f":"IF('Data Input'!A268=0,\"\",'Data Input'!A268)","v":""},{"$f":"IF(ISBLANK('Data Input'!A268),\"\",COUNTIF('Data Input'!C268:AA268,\"\"))","v":""},{"$f":"IF(ISBLANK('Data Input'!A268),\"\",COUNTIF('Data Input'!C268:AA268,\"0\"))","v":""},{"$f":"IF(ISBLANK('Data Input'!A268),\"\",SUM(B263,C263))","v":""},{"$f":"IF(ISBLANK('Data Input'!A268),\"\",SUM('Data Input'!C268:AA268))","v":""},{"$f":"IF(E263=\"\",\"\",E263/(COUNTA('Data Input'!$C$8:$AA$8)))","v":""},{"$f":"IF(ISBLANK('Data Input'!A268),\"\",SUM('Data Input'!C268,'Data Input'!F268,'Data Input'!G268,'Data Input'!J268,'Data Input'!L268,'Data Input'!O268,'Data Input'!Q268,'Data Input'!R268,'Data Input'!U268))","v":""},{"$f":"IF(G263=\"\",\"\",G263/COUNTIF('Data Input'!$C$8:$AA$8,\"+\"))","v":""},{"$f":"IF(ISBLANK('Data Input'!A268),\"\",SUM('Data Input'!D268,'Data Input'!E268,'Data Input'!K268,'Data Input'!M268,'Data Input'!Y268))","v":""},{"$f":"IF(I263=\"\",\"\",I263/COUNTIF('Data Input'!$C$8:$AA$8,\"-\"))","v":""},{"$f":"IF(ISBLANK('Data Input'!A268),\"\",SUM('Data Input'!H268,'Data Input'!I268,'Data Input'!N268,'Data Input'!S268))","v":""},{"$f":"IF(K263=\"\",\"\",K263/COUNTIF('Data Input'!$C$8:$AA$8,\"x\"))","v":""},{"$f":"IF(ISBLANK('Data Input'!A268),\"\",SUM('Data Input'!P268,'Data Input'!V268,'Data Input'!W268))","v":""},{"$f":"IF(M263=\"\",\"\",M263/COUNTIF('Data Input'!$C$8:$AA$8,\"÷\"))","v":""},{"$f":"IF(ISBLANK('Data Input'!A268),\"\",SUM('Data Input'!T268,'Data Input'!X268,'Data Input'!Z268,'Data Input'!AA268))","v":""},{"$f":"IF(O263=\"\",\"\",O263/COUNTIF('Data Input'!$C$8:$AA$8,\"F\"))","v":""}]
[{"$f":"IF('Data Input'!A269=0,\"\",'Data Input'!A269)","v":""},{"$f":"IF(ISBLANK('Data Input'!A269),\"\",COUNTIF('Data Input'!C269:AA269,\"\"))","v":""},{"$f":"IF(ISBLANK('Data Input'!A269),\"\",COUNTIF('Data Input'!C269:AA269,\"0\"))","v":""},{"$f":"IF(ISBLANK('Data Input'!A269),\"\",SUM(B264,C264))","v":""},{"$f":"IF(ISBLANK('Data Input'!A269),\"\",SUM('Data Input'!C269:AA269))","v":""},{"$f":"IF(E264=\"\",\"\",E264/(COUNTA('Data Input'!$C$8:$AA$8)))","v":""},{"$f":"IF(ISBLANK('Data Input'!A269),\"\",SUM('Data Input'!C269,'Data Input'!F269,'Data Input'!G269,'Data Input'!J269,'Data Input'!L269,'Data Input'!O269,'Data Input'!Q269,'Data Input'!R269,'Data Input'!U269))","v":""},{"$f":"IF(G264=\"\",\"\",G264/COUNTIF('Data Input'!$C$8:$AA$8,\"+\"))","v":""},{"$f":"IF(ISBLANK('Data Input'!A269),\"\",SUM('Data Input'!D269,'Data Input'!E269,'Data Input'!K269,'Data Input'!M269,'Data Input'!Y269))","v":""},{"$f":"IF(I264=\"\",\"\",I264/COUNTIF('Data Input'!$C$8:$AA$8,\"-\"))","v":""},{"$f":"IF(ISBLANK('Data Input'!A269),\"\",SUM('Data Input'!H269,'Data Input'!I269,'Data Input'!N269,'Data Input'!S269))","v":""},{"$f":"IF(K264=\"\",\"\",K264/COUNTIF('Data Input'!$C$8:$AA$8,\"x\"))","v":""},{"$f":"IF(ISBLANK('Data Input'!A269),\"\",SUM('Data Input'!P269,'Data Input'!V269,'Data Input'!W269))","v":""},{"$f":"IF(M264=\"\",\"\",M264/COUNTIF('Data Input'!$C$8:$AA$8,\"÷\"))","v":""},{"$f":"IF(ISBLANK('Data Input'!A269),\"\",SUM('Data Input'!T269,'Data Input'!X269,'Data Input'!Z269,'Data Input'!AA269))","v":""},{"$f":"IF(O264=\"\",\"\",O264/COUNTIF('Data Input'!$C$8:$AA$8,\"F\"))","v":""}]
[{"$f":"IF('Data Input'!A270=0,\"\",'Data Input'!A270)","v":""},{"$f":"IF(ISBLANK('Data Input'!A270),\"\",COUNTIF('Data Input'!C270:AA270,\"\"))","v":""},{"$f":"IF(ISBLANK('Data Input'!A270),\"\",COUNTIF('Data Input'!C270:AA270,\"0\"))","v":""},{"$f":"IF(ISBLANK('Data Input'!A270),\"\",SUM(B265,C265))","v":""},{"$f":"IF(ISBLANK('Data Input'!A270),\"\",SUM('Data Input'!C270:AA270))","v":""},{"$f":"IF(E265=\"\",\"\",E265/(COUNTA('Data Input'!$C$8:$AA$8)))","v":""},{"$f":"IF(ISBLANK('Data Input'!A270),\"\",SUM('Data Input'!C270,'Data Input'!F270,'Data Input'!G270,'Data Input'!J270,'Data Input'!L270,'Data Input'!O270,'Data Input'!Q270,'Data Input'!R270,'Data Input'!U270))","v":""},{"$f":"IF(G265=\"\",\"\",G265/COUNTIF('Data Input'!$C$8:$AA$8,\"+\"))","v":""},{"$f":"IF(ISBLANK('Data Input'!A270),\"\",SUM('Data Input'!D270,'Data Input'!E270,'Data Input'!K270,'Data Input'!M270,'Data Input'!Y270))","v":""},{"$f":"IF(I265=\"\",\"\",I265/COUNTIF('Data Input'!$C$8:$AA$8,\"-\"))","v":""},{"$f":"IF(ISBLANK('Data Input'!A270),\"\",SUM('Data Input'!H270,'Data Input'!I270,'Data Input'!N270,'Data Input'!S270))","v":""},{"$f":"IF(K265=\"\",\"\",K265/COUNTIF('Data Input'!$C$8:$AA$8,\"x\"))","v":""},{"$f":"IF(ISBLANK('Data Input'!A270),\"\",SUM('Data Input'!P270,'Data Input'!V270,'Data Input'!W270))","v":""},{"$f":"IF(M265=\"\",\"\",M265/COUNTIF('Data Input'!$C$8:$AA$8,\"÷\"))","v":""},{"$f":"IF(ISBLANK('Data Input'!A270),\"\",SUM('Data Input'!T270,'Data Input'!X270,'Data Input'!Z270,'Data Input'!AA270))","v":""},{"$f":"IF(O265=\"\",\"\",O265/COUNTIF('Data Input'!$C$8:$AA$8,\"F\"))","v":""}]
[{"$f":"IF('Data Input'!A271=0,\"\",'Data Input'!A271)","v":""},{"$f":"IF(ISBLANK('Data Input'!A271),\"\",COUNTIF('Data Input'!C271:AA271,\"\"))","v":""},{"$f":"IF(ISBLANK('Data Input'!A271),\"\",COUNTIF('Data Input'!C271:AA271,\"0\"))","v":""},{"$f":"IF(ISBLANK('Data Input'!A271),\"\",SUM(B266,C266))","v":""},{"$f":"IF(ISBLANK('Data Input'!A271),\"\",SUM('Data Input'!C271:AA271))","v":""},{"$f":"IF(E266=\"\",\"\",E266/(COUNTA('Data Input'!$C$8:$AA$8)))","v":""},{"$f":"IF(ISBLANK('Data Input'!A271),\"\",SUM('Data Input'!C271,'Data Input'!F271,'Data Input'!G271,'Data Input'!J271,'Data Input'!L271,'Data Input'!O271,'Data Input'!Q271,'Data Input'!R271,'Data Input'!U271))","v":""},{"$f":"IF(G266=\"\",\"\",G266/COUNTIF('Data Input'!$C$8:$AA$8,\"+\"))","v":""},{"$f":"IF(ISBLANK('Data Input'!A271),\"\",SUM('Data Input'!D271,'Data Input'!E271,'Data Input'!K271,'Data Input'!M271,'Data Input'!Y271))","v":""},{"$f":"IF(I266=\"\",\"\",I266/COUNTIF('Data Input'!$C$8:$AA$8,\"-\"))","v":""},{"$f":"IF(ISBLANK('Data Input'!A271),\"\",SUM('Data Input'!H271,'Data Input'!I271,'Data Input'!N271,'Data Input'!S271))","v":""},{"$f":"IF(K266=\"\",\"\",K266/COUNTIF('Data Input'!$C$8:$AA$8,\"x\"))","v":""},{"$f":"IF(ISBLANK('Data Input'!A271),\"\",SUM('Data Input'!P271,'Data Input'!V271,'Data Input'!W271))","v":""},{"$f":"IF(M266=\"\",\"\",M266/COUNTIF('Data Input'!$C$8:$AA$8,\"÷\"))","v":""},{"$f":"IF(ISBLANK('Data Input'!A271),\"\",SUM('Data Input'!T271,'Data Input'!X271,'Data Input'!Z271,'Data Input'!AA271))","v":""},{"$f":"IF(O266=\"\",\"\",O266/COUNTIF('Data Input'!$C$8:$AA$8,\"F\"))","v":""}]
[{"$f":"IF('Data Input'!A272=0,\"\",'Data Input'!A272)","v":""},{"$f":"IF(ISBLANK('Data Input'!A272),\"\",COUNTIF('Data Input'!C272:AA272,\"\"))","v":""},{"$f":"IF(ISBLANK('Data Input'!A272),\"\",COUNTIF('Data Input'!C272:AA272,\"0\"))","v":""},{"$f":"IF(ISBLANK('Data Input'!A272),\"\",SUM(B267,C267))","v":""},{"$f":"IF(ISBLANK('Data Input'!A272),\"\",SUM('Data Input'!C272:AA272))","v":""},{"$f":"IF(E267=\"\",\"\",E267/(COUNTA('Data Input'!$C$8:$AA$8)))","v":""},{"$f":"IF(ISBLANK('Data Input'!A272),\"\",SUM('Data Input'!C272,'Data Input'!F272,'Data Input'!G272,'Data Input'!J272,'Data Input'!L272,'Data Input'!O272,'Data Input'!Q272,'Data Input'!R272,'Data Input'!U272))","v":""},{"$f":"IF(G267=\"\",\"\",G267/COUNTIF('Data Input'!$C$8:$AA$8,\"+\"))","v":""},{"$f":"IF(ISBLANK('Data Input'!A272),\"\",SUM('Data Input'!D272,'Data Input'!E272,'Data Input'!K272,'Data Input'!M272,'Data Input'!Y272))","v":""},{"$f":"IF(I267=\"\",\"\",I267/COUNTIF('Data Input'!$C$8:$AA$8,\"-\"))","v":""},{"$f":"IF(ISBLANK('Data Input'!A272),\"\",SUM('Data Input'!H272,'Data Input'!I272,'Data Input'!N272,'Data Input'!S272))","v":""},{"$f":"IF(K267=\"\",\"\",K267/COUNTIF('Data Input'!$C$8:$AA$8,\"x\"))","v":""},{"$f":"IF(ISBLANK('Data Input'!A272),\"\",SUM('Data Input'!P272,'Data Input'!V272,'Data Input'!W272))","v":""},{"$f":"IF(M267=\"\",\"\",M267/COUNTIF('Data Input'!$C$8:$AA$8,\"÷\"))","v":""},{"$f":"IF(ISBLANK('Data Input'!A272),\"\",SUM('Data Input'!T272,'Data Input'!X272,'Data Input'!Z272,'Data Input'!AA272))","v":""},{"$f":"IF(O267=\"\",\"\",O267/COUNTIF('Data Input'!$C$8:$AA$8,\"F\"))","v":""}]
[{"$f":"IF('Data Input'!A273=0,\"\",'Data Input'!A273)","v":""},{"$f":"IF(ISBLANK('Data Input'!A273),\"\",COUNTIF('Data Input'!C273:AA273,\"\"))","v":""},{"$f":"IF(ISBLANK('Data Input'!A273),\"\",COUNTIF('Data Input'!C273:AA273,\"0\"))","v":""},{"$f":"IF(ISBLANK('Data Input'!A273),\"\",SUM(B268,C268))","v":""},{"$f":"IF(ISBLANK('Data Input'!A273),\"\",SUM('Data Input'!C273:AA273))","v":""},{"$f":"IF(E268=\"\",\"\",E268/(COUNTA('Data Input'!$C$8:$AA$8)))","v":""},{"$f":"IF(ISBLANK('Data Input'!A273),\"\",SUM('Data Input'!C273,'Data Input'!F273,'Data Input'!G273,'Data Input'!J273,'Data Input'!L273,'Data Input'!O273,'Data Input'!Q273,'Data Input'!R273,'Data Input'!U273))","v":""},{"$f":"IF(G268=\"\",\"\",G268/COUNTIF('Data Input'!$C$8:$AA$8,\"+\"))","v":""},{"$f":"IF(ISBLANK('Data Input'!A273),\"\",SUM('Data Input'!D273,'Data Input'!E273,'Data Input'!K273,'Data Input'!M273,'Data Input'!Y273))","v":""},{"$f":"IF(I268=\"\",\"\",I268/COUNTIF('Data Input'!$C$8:$AA$8,\"-\"))","v":""},{"$f":"IF(ISBLANK('Data Input'!A273),\"\",SUM('Data Input'!H273,'Data Input'!I273,'Data Input'!N273,'Data Input'!S273))","v":""},{"$f":"IF(K268=\"\",\"\",K268/COUNTIF('Data Input'!$C$8:$AA$8,\"x\"))","v":""},{"$f":"IF(ISBLANK('Data Input'!A273),\"\",SUM('Data Input'!P273,'Data Input'!V273,'Data Input'!W273))","v":""},{"$f":"IF(M268=\"\",\"\",M268/COUNTIF('Data Input'!$C$8:$AA$8,\"÷\"))","v":""},{"$f":"IF(ISBLANK('Data Input'!A273),\"\",SUM('Data Input'!T273,'Data Input'!X273,'Data Input'!Z273,'Data Input'!AA273))","v":""},{"$f":"IF(O268=\"\",\"\",O268/COUNTIF('Data Input'!$C$8:$AA$8,\"F\"))","v":""}]
[{"$f":"IF('Data Input'!A274=0,\"\",'Data Input'!A274)","v":""},{"$f":"IF(ISBLANK('Data Input'!A274),\"\",COUNTIF('Data Input'!C274:AA274,\"\"))","v":""},{"$f":"IF(ISBLANK('Data Input'!A274),\"\",COUNTIF('Data Input'!C274:AA274,\"0\"))","v":""},{"$f":"IF(ISBLANK('Data Input'!A274),\"\",SUM(B269,C269))","v":""},{"$f":"IF(ISBLANK('Data Input'!A274),\"\",SUM('Data Input'!C274:AA274))","v":""},{"$f":"IF(E269=\"\",\"\",E269/(COUNTA('Data Input'!$C$8:$AA$8)))","v":""},{"$f":"IF(ISBLANK('Data Input'!A274),\"\",SUM('Data Input'!C274,'Data Input'!F274,'Data Input'!G274,'Data Input'!J274,'Data Input'!L274,'Data Input'!O274,'Data Input'!Q274,'Data Input'!R274,'Data Input'!U274))","v":""},{"$f":"IF(G269=\"\",\"\",G269/COUNTIF('Data Input'!$C$8:$AA$8,\"+\"))","v":""},{"$f":"IF(ISBLANK('Data Input'!A274),\"\",SUM('Data Input'!D274,'Data Input'!E274,'Data Input'!K274,'Data Input'!M274,'Data Input'!Y274))","v":""},{"$f":"IF(I269=\"\",\"\",I269/COUNTIF('Data Input'!$C$8:$AA$8,\"-\"))","v":""},{"$f":"IF(ISBLANK('Data Input'!A274),\"\",SUM('Data Input'!H274,'Data Input'!I274,'Data Input'!N274,'Data Input'!S274))","v":""},{"$f":"IF(K269=\"\",\"\",K269/COUNTIF('Data Input'!$C$8:$AA$8,\"x\"))","v":""},{"$f":"IF(ISBLANK('Data Input'!A274),\"\",SUM('Data Input'!P274,'Data Input'!V274,'Data Input'!W274))","v":""},{"$f":"IF(M269=\"\",\"\",M269/COUNTIF('Data Input'!$C$8:$AA$8,\"÷\"))","v":""},{"$f":"IF(ISBLANK('Data Input'!A274),\"\",SUM('Data Input'!T274,'Data Input'!X274,'Data Input'!Z274,'Data Input'!AA274))","v":""},{"$f":"IF(O269=\"\",\"\",O269/COUNTIF('Data Input'!$C$8:$AA$8,\"F\"))","v":""}]
[{"$f":"IF('Data Input'!A275=0,\"\",'Data Input'!A275)","v":""},{"$f":"IF(ISBLANK('Data Input'!A275),\"\",COUNTIF('Data Input'!C275:AA275,\"\"))","v":""},{"$f":"IF(ISBLANK('Data Input'!A275),\"\",COUNTIF('Data Input'!C275:AA275,\"0\"))","v":""},{"$f":"IF(ISBLANK('Data Input'!A275),\"\",SUM(B270,C270))","v":""},{"$f":"IF(ISBLANK('Data Input'!A275),\"\",SUM('Data Input'!C275:AA275))","v":""},{"$f":"IF(E270=\"\",\"\",E270/(COUNTA('Data Input'!$C$8:$AA$8)))","v":""},{"$f":"IF(ISBLANK('Data Input'!A275),\"\",SUM('Data Input'!C275,'Data Input'!F275,'Data Input'!G275,'Data Input'!J275,'Data Input'!L275,'Data Input'!O275,'Data Input'!Q275,'Data Input'!R275,'Data Input'!U275))","v":""},{"$f":"IF(G270=\"\",\"\",G270/COUNTIF('Data Input'!$C$8:$AA$8,\"+\"))","v":""},{"$f":"IF(ISBLANK('Data Input'!A275),\"\",SUM('Data Input'!D275,'Data Input'!E275,'Data Input'!K275,'Data Input'!M275,'Data Input'!Y275))","v":""},{"$f":"IF(I270=\"\",\"\",I270/COUNTIF('Data Input'!$C$8:$AA$8,\"-\"))","v":""},{"$f":"IF(ISBLANK('Data Input'!A275),\"\",SUM('Data Input'!H275,'Data Input'!I275,'Data Input'!N275,'Data Input'!S275))","v":""},{"$f":"IF(K270=\"\",\"\",K270/COUNTIF('Data Input'!$C$8:$AA$8,\"x\"))","v":""},{"$f":"IF(ISBLANK('Data Input'!A275),\"\",SUM('Data Input'!P275,'Data Input'!V275,'Data Input'!W275))","v":""},{"$f":"IF(M270=\"\",\"\",M270/COUNTIF('Data Input'!$C$8:$AA$8,\"÷\"))","v":""},{"$f":"IF(ISBLANK('Data Input'!A275),\"\",SUM('Data Input'!T275,'Data Input'!X275,'Data Input'!Z275,'Data Input'!AA275))","v":""},{"$f":"IF(O270=\"\",\"\",O270/COUNTIF('Data Input'!$C$8:$AA$8,\"F\"))","v":""}]
[{"$f":"IF('Data Input'!A276=0,\"\",'Data Input'!A276)","v":""},{"$f":"IF(ISBLANK('Data Input'!A276),\"\",COUNTIF('Data Input'!C276:AA276,\"\"))","v":""},{"$f":"IF(ISBLANK('Data Input'!A276),\"\",COUNTIF('Data Input'!C276:AA276,\"0\"))","v":""},{"$f":"IF(ISBLANK('Data Input'!A276),\"\",SUM(B271,C271))","v":""},{"$f":"IF(ISBLANK('Data Input'!A276),\"\",SUM('Data Input'!C276:AA276))","v":""},{"$f":"IF(E271=\"\",\"\",E271/(COUNTA('Data Input'!$C$8:$AA$8)))","v":""},{"$f":"IF(ISBLANK('Data Input'!A276),\"\",SUM('Data Input'!C276,'Data Input'!F276,'Data Input'!G276,'Data Input'!J276,'Data Input'!L276,'Data Input'!O276,'Data Input'!Q276,'Data Input'!R276,'Data Input'!U276))","v":""},{"$f":"IF(G271=\"\",\"\",G271/COUNTIF('Data Input'!$C$8:$AA$8,\"+\"))","v":""},{"$f":"IF(ISBLANK('Data Input'!A276),\"\",SUM('Data Input'!D276,'Data Input'!E276,'Data Input'!K276,'Data Input'!M276,'Data Input'!Y276))","v":""},{"$f":"IF(I271=\"\",\"\",I271/COUNTIF('Data Input'!$C$8:$AA$8,\"-\"))","v":""},{"$f":"IF(ISBLANK('Data Input'!A276),\"\",SUM('Data Input'!H276,'Data Input'!I276,'Data Input'!N276,'Data Input'!S276))","v":""},{"$f":"IF(K271=\"\",\"\",K271/COUNTIF('Data Input'!$C$8:$AA$8,\"x\"))","v":""},{"$f":"IF(ISBLANK('Data Input'!A276),\"\",SUM('Data Input'!P276,'Data Input'!V276,'Data Input'!W276))","v":""},{"$f":"IF(M271=\"\",\"\",M271/COUNTIF('Data Input'!$C$8:$AA$8,\"÷\"))","v":""},{"$f":"IF(ISBLANK('Data Input'!A276),\"\",SUM('Data Input'!T276,'Data Input'!X276,'Data Input'!Z276,'Data Input'!AA276))","v":""},{"$f":"IF(O271=\"\",\"\",O271/COUNTIF('Data Input'!$C$8:$AA$8,\"F\"))","v":""}]
[{"$f":"IF('Data Input'!A277=0,\"\",'Data Input'!A277)","v":""},{"$f":"IF(ISBLANK('Data Input'!A277),\"\",COUNTIF('Data Input'!C277:AA277,\"\"))","v":""},{"$f":"IF(ISBLANK('Data Input'!A277),\"\",COUNTIF('Data Input'!C277:AA277,\"0\"))","v":""},{"$f":"IF(ISBLANK('Data Input'!A277),\"\",SUM(B272,C272))","v":""},{"$f":"IF(ISBLANK('Data Input'!A277),\"\",SUM('Data Input'!C277:AA277))","v":""},{"$f":"IF(E272=\"\",\"\",E272/(COUNTA('Data Input'!$C$8:$AA$8)))","v":""},{"$f":"IF(ISBLANK('Data Input'!A277),\"\",SUM('Data Input'!C277,'Data Input'!F277,'Data Input'!G277,'Data Input'!J277,'Data Input'!L277,'Data Input'!O277,'Data Input'!Q277,'Data Input'!R277,'Data Input'!U277))","v":""},{"$f":"IF(G272=\"\",\"\",G272/COUNTIF('Data Input'!$C$8:$AA$8,\"+\"))","v":""},{"$f":"IF(ISBLANK('Data Input'!A277),\"\",SUM('Data Input'!D277,'Data Input'!E277,'Data Input'!K277,'Data Input'!M277,'Data Input'!Y277))","v":""},{"$f":"IF(I272=\"\",\"\",I272/COUNTIF('Data Input'!$C$8:$AA$8,\"-\"))","v":""},{"$f":"IF(ISBLANK('Data Input'!A277),\"\",SUM('Data Input'!H277,'Data Input'!I277,'Data Input'!N277,'Data Input'!S277))","v":""},{"$f":"IF(K272=\"\",\"\",K272/COUNTIF('Data Input'!$C$8:$AA$8,\"x\"))","v":""},{"$f":"IF(ISBLANK('Data Input'!A277),\"\",SUM('Data Input'!P277,'Data Input'!V277,'Data Input'!W277))","v":""},{"$f":"IF(M272=\"\",\"\",M272/COUNTIF('Data Input'!$C$8:$AA$8,\"÷\"))","v":""},{"$f":"IF(ISBLANK('Data Input'!A277),\"\",SUM('Data Input'!T277,'Data Input'!X277,'Data Input'!Z277,'Data Input'!AA277))","v":""},{"$f":"IF(O272=\"\",\"\",O272/COUNTIF('Data Input'!$C$8:$AA$8,\"F\"))","v":""}]
[{"$f":"IF('Data Input'!A278=0,\"\",'Data Input'!A278)","v":""},{"$f":"IF(ISBLANK('Data Input'!A278),\"\",COUNTIF('Data Input'!C278:AA278,\"\"))","v":""},{"$f":"IF(ISBLANK('Data Input'!A278),\"\",COUNTIF('Data Input'!C278:AA278,\"0\"))","v":""},{"$f":"IF(ISBLANK('Data Input'!A278),\"\",SUM(B273,C273))","v":""},{"$f":"IF(ISBLANK('Data Input'!A278),\"\",SUM('Data Input'!C278:AA278))","v":""},{"$f":"IF(E273=\"\",\"\",E273/(COUNTA('Data Input'!$C$8:$AA$8)))","v":""},{"$f":"IF(ISBLANK('Data Input'!A278),\"\",SUM('Data Input'!C278,'Data Input'!F278,'Data Input'!G278,'Data Input'!J278,'Data Input'!L278,'Data Input'!O278,'Data Input'!Q278,'Data Input'!R278,'Data Input'!U278))","v":""},{"$f":"IF(G273=\"\",\"\",G273/COUNTIF('Data Input'!$C$8:$AA$8,\"+\"))","v":""},{"$f":"IF(ISBLANK('Data Input'!A278),\"\",SUM('Data Input'!D278,'Data Input'!E278,'Data Input'!K278,'Data Input'!M278,'Data Input'!Y278))","v":""},{"$f":"IF(I273=\"\",\"\",I273/COUNTIF('Data Input'!$C$8:$AA$8,\"-\"))","v":""},{"$f":"IF(ISBLANK('Data Input'!A278),\"\",SUM('Data Input'!H278,'Data Input'!I278,'Data Input'!N278,'Data Input'!S278))","v":""},{"$f":"IF(K273=\"\",\"\",K273/COUNTIF('Data Input'!$C$8:$AA$8,\"x\"))","v":""},{"$f":"IF(ISBLANK('Data Input'!A278),\"\",SUM('Data Input'!P278,'Data Input'!V278,'Data Input'!W278))","v":""},{"$f":"IF(M273=\"\",\"\",M273/COUNTIF('Data Input'!$C$8:$AA$8,\"÷\"))","v":""},{"$f":"IF(ISBLANK('Data Input'!A278),\"\",SUM('Data Input'!T278,'Data Input'!X278,'Data Input'!Z278,'Data Input'!AA278))","v":""},{"$f":"IF(O273=\"\",\"\",O273/COUNTIF('Data Input'!$C$8:$AA$8,\"F\"))","v":""}]

{"sheet":"Cohort Summary","index":4,"n_rows":12,"n_cols":6,"rows_kept":12,"cut":false,"hidden":false,"merged":[[11,0,13,4]]}
["Class Averages:",{"$f":"'Pupil Summary'!G2","v":"+"},{"$f":"'Pupil Summary'!I2","v":"-"},{"$f":"'Pupil Summary'!K2","v":"x"},{"$f":"'Pupil Summary'!M2","v":"÷"},{"$f":"'Pupil Summary'!O2","v":"F"}]
["Class correct:",{"$f":"IF(ISERROR(B4/B3),\"\",(B4/B3))","v":0.88888888888888884},{"$f":"IF(ISERROR(C4/C3),\"\",(C4/C3))","v":1},{"$f":"IF(ISERROR(D4/D3),\"\",(D4/D3))","v":0.75},{"$f":"IF(ISERROR(E4/E3),\"\",(E4/E3))","v":1},{"$f":"IF(ISERROR(F4/F3),\"\",(F4/F3))","v":0.75}]
["Maximum",{"$f":"COUNTIF('Data Input'!$C$8:$AA$8,B1)","v":9},{"$f":"COUNTIF('Data Input'!$C$8:$AA$8,C1)","v":5},{"$f":"COUNTIF('Data Input'!$C$8:$AA$8,D1)","v":4},{"$f":"COUNTIF('Data Input'!$C$8:$AA$8,E1)","v":3},{"$f":"COUNTIF('Data Input'!$C$8:$AA$8,F1)","v":4}]
["Correct",{"$f":"IF(ISERROR(AVERAGE(IF(('Data Input'!$C$8:$AA$8=$B$1),'Data Input'!$C2:$AA2))*$B$3/COUNTA('Data Input'!$A$10:$A$278)),\"\",AVERAGE(IF(('Data Input'!$C$8:$AA$8=$B$1),'Data Input'!$C2:$AA2))*$B$3/COUNTA('Data Input'!$A$10:$A$278))","v":8},{"$f":"IF(ISERROR(AVERAGE(IF(('Data Input'!$C$8:$AA$8=$C$1),'Data Input'!$C2:$AA2))*$C$3/COUNTA('Data Input'!$A$10:$A$278)),\"\",AVERAGE(IF(('Data Input'!$C$8:$AA$8=$C$1),'Data Input'!$C2:$AA2))*$C$3/COUNTA('Data Input'!$A$10:$A$278))","v":5},{"$f":"IF(ISERROR(AVERAGE(IF(('Data Input'!$C$8:$AA$8=$D$1),'Data Input'!$C2:$AA2))*$D$3/COUNTA('Data Input'!$A$10:$A$278)),\"\",AVERAGE(IF(('Data Input'!$C$8:$AA$8=$D$1),'Data Input'!$C2:$AA2))*$D$3/COUNTA('Data Input'!$A$10:$A$278))","v":3},{"$f":"IF(ISERROR(AVERAGE(IF(('Data Input'!$C$8:$AA$8=$E$1),'Data Input'!$C2:$AA2))*$E$3/COUNTA('Data Input'!$A$10:$A$278)),\"\",AVERAGE(IF(('Data Input'!$C$8:$AA$8=$E$1),'Data Input'!$C2:$AA2))*$E$3/COUNTA('Data Input'!$A$10:$A$278))","v":3},{"$f":"IF(ISERROR(AVERAGE(IF(('Data Input'!$C$8:$AA$8=$F$1),'Data Input'!$C2:$AA2))*$F$3/COUNTA('Data Input'!$A$10:$A$278)),\"\",AVERAGE(IF(('Data Input'!$C$8:$AA$8=$F$1),'Data Input'!$C2:$AA2))*$F$3/COUNTA('Data Input'!$A$10:$A$278))","v":3}]
["Incorrect",{"$f":"IF(ISERROR(AVERAGE(IF(('Data Input'!$C$8:$AA$8=$B$1),'Data Input'!$C3:$AA3))*$B$3/COUNTA('Data Input'!$A$10:$A$278)),\"\",AVERAGE(IF(('Data Input'!$C$8:$AA$8=$B$1),'Data Input'!$C3:$AA3))*$B$3/COUNTA('Data Input'!$A$10:$A$278))","v":1},{"$f":"IF(ISERROR(AVERAGE(IF(('Data Input'!$C$8:$AA$8=$C$1),'Data Input'!$C3:$AA3))*$C$3/COUNTA('Data Input'!$A$10:$A$278)),\"\",AVERAGE(IF(('Data Input'!$C$8:$AA$8=$C$1),'Data Input'!$C3:$AA3))*$C$3/COUNTA('Data Input'!$A$10:$A$278))","v":0},{"$f":"IF(ISERROR(AVERAGE(IF(('Data Input'!$C$8:$AA$8=$D$1),'Data Input'!$C3:$AA3))*$D$3/COUNTA('Data Input'!$A$10:$A$278)),\"\",AVERAGE(IF(('Data Input'!$C$8:$AA$8=$D$1),'Data Input'!$C3:$AA3))*$D$3/COUNTA('Data Input'!$A$10:$A$278))","v":0},{"$f":"IF(ISERROR(AVERAGE(IF(('Data Input'!$C$8:$AA$8=$E$1),'Data Input'!$C3:$AA3))*$E$3/COUNTA('Data Input'!$A$10:$A$278)),\"\",AVERAGE(IF(('Data Input'!$C$8:$AA$8=$E$1),'Data Input'!$C3:$AA3))*$E$3/COUNTA('Data Input'!$A$10:$A$278))","v":0},{"$f":"IF(ISERROR(AVERAGE(IF(('Data Input'!$C$8:$AA$8=$F$1),'Data Input'!$C3:$AA3))*$F$3/COUNTA('Data Input'!$A$10:$A$278)),\"\",AVERAGE(IF(('Data Input'!$C$8:$AA$8=$F$1),'Data Input'!$C3:$AA3))*$F$3/COUNTA('Data Input'!$A$10:$A$278))","v":1}]
["Unanswered",{"$f":"IF(ISERROR(AVERAGE(IF(('Data Input'!$C$8:$AA$8=$B$1),'Data Input'!$C4:$AA4))*$B$3/COUNTA('Data Input'!$A$10:$A$278)),\"\",AVERAGE(IF(('Data Input'!$C$8:$AA$8=$B$1),'Data Input'!$C4:$AA4))*$B$3/COUNTA('Data Input'!$A$10:$A$278))","v":0},{"$f":"IF(ISERROR(AVERAGE(IF(('Data Input'!$C$8:$AA$8=$C$1),'Data Input'!$C4:$AA4))*$C$3/COUNTA('Data Input'!$A$10:$A$278)),\"\",AVERAGE(IF(('Data Input'!$C$8:$AA$8=$C$1),'Data Input'!$C4:$AA4))*$C$3/COUNTA('Data Input'!$A$10:$A$278))","v":0},{"$f":"IF(ISERROR(AVERAGE(IF(('Data Input'!$C$8:$AA$8=$D$1),'Data Input'!$C4:$AA4))*$D$3/COUNTA('Data Input'!$A$10:$A$278)),\"\",AVERAGE(IF(('Data Input'!$C$8:$AA$8=$D$1),'Data Input'!$C4:$AA4))*$D$3/COUNTA('Data Input'!$A$10:$A$278))","v":1},{"$f":"IF(ISERROR(AVERAGE(IF(('Data Input'!$C$8:$AA$8=$E$1),'Data Input'!$C4:$AA4))*$E$3/COUNTA('Data Input'!$A$10:$A$278)),\"\",AVERAGE(IF(('Data Input'!$C$8:$AA$8=$E$1),'Data Input'!$C4:$AA4))*$E$3/COUNTA('Data Input'!$A$10:$A$278))","v":0},{"$f":"IF(ISERROR(AVERAGE(IF(('Data Input'!$C$8:$AA$8=$F$1),'Data Input'!$C4:$AA4))*$F$3/COUNTA('Data Input'!$A$10:$A$278)),\"\",AVERAGE(IF(('Data Input'!$C$8:$AA$8=$F$1),'Data Input'!$C4:$AA4))*$F$3/COUNTA('Data Input'!$A$10:$A$278))","v":0}]
["Incorrect or unanswered",{"$f":"IF(ISERROR(SUM(B5,B6)),\"\",SUM(B5,B6))","v":1},{"$f":"IF(ISERROR(SUM(C5,C6)),\"\",SUM(C5,C6))","v":0},{"$f":"IF(ISERROR(SUM(D5,D6)),\"\",SUM(D5,D6))","v":1},{"$f":"IF(ISERROR(SUM(E5,E6)),\"\",SUM(E5,E6))","v":0},{"$f":"IF(ISERROR(SUM(F5,F6)),\"\",SUM(F5,F6))","v":1}]
[]
[{"$f":"\"Average Total Score \"&COUNTA('Data Input'!C8:AA8)","v":"Average Total Score 25"},"Total"]
[{"$f":"IF(ISERROR(AVERAGE('Pupil Summary'!E5:E273)),\"\",AVERAGE('Pupil Summary'!E5:E273))","v":22},{"$f":"IF(ISERROR(A10/COUNTA('Data Input'!C8:AA8)-1),\"\",A10/(COUNTA('Data Input'!C8:AA8)))","v":0.88}]
[]
["The chart below graph shows the average percent for the cohort answering the questions in the particular area correctly. It should be noted that here each area does not hold equal weighting."]

{"sheet":"Strand Summary","index":5,"n_rows":28,"n_cols":2,"rows_kept":28,"cut":false,"hidden":false,"merged":[[26,1,26,11],[27,1,27,11]]}
[]
[]
[]
[]
[]
[]
[]
[]
[]
[]
[]
[]
[]
[]
[]
[]
[]
[]
[]
[]
[]
[]
[]
[]
[]
[]
[null,"This height of the bar shows the weighting of each area and the average number correct and incorrect answers. "]
[null,"A large area of red would indicate an area of priority. "]

{"sheet":"Questions by Strand","index":6,"n_rows":0,"n_cols":0,"rows_kept":0,"cut":false,"hidden":false,"merged":[[45,0,46,17]]}

{"sheet":"Questions by Correct","index":7,"n_rows":0,"n_cols":0,"rows_kept":0,"cut":false,"hidden":false,"merged":[[45,0,46,17]]}

{"sheet":"Questions by Sub Type","index":8,"n_rows":0,"n_cols":0,"rows_kept":0,"cut":false,"hidden":false,"merged":[[45,0,46,17]]}